BDBM194880 US9206184, 61
SMILES: COc1cc(C)cc2cc(sc12)-c1c(-c2cnco2)c(CN2CCNCC2)n2ncnc(N)c12
InChI Key: InChIKey=PVLAKZNIDMGUHQ-UHFFFAOYSA-N
Data: 2 IC50
Activity Spreadsheet -- Enzyme Inhibition Constant Data from BindingDB
Found 2 hits for monomerid = 194880
Trg + Lig
Ki
nM
ΔG°
kcal/mole
IC50
nM
Kd
nM
EC50/IC50
nM
koff
s-1
kon
M-1s-1
pHTemp
°C
Fibroblast growth factor receptor 3
(Homo sapiens (Human))
BDBM194880
(US9206184, 61)
Show SMILES COc1cc(C)cc2cc(sc12)-c1c(-c2cnco2)c(CN2CCNCC2)n2ncnc(N)c12
Show InChI InChI=1S/C24H25N7O2S/c1-14-7-15-9-19(34-23(15)17(8-14)32-2)21-20(18-10-27-13-33-18)16(11-30-5-3-26-4-6-30)31-22(21)24(25)28-12-29-31/h7-10,12-13,26H,3-6,11H2,1-2H3,(H2,25,28,29)
Reactome pathway
US Patent
n/an/a 0.900n/an/an/an/a7.022
BAYER INTELLECTUAL PROPERTY GmbH
US Patent
Assay Description
For the assay, 50 nl of each stock solution of the test compound in DMSO was pipetted into a black, low-volume 384-well microtiter plate (Greiner Bio...
US Patent US9206184 (2015)
BindingDB Entry DOI: 10.7270/Q2SN07SH
Fibroblast growth factor receptor 1
(Homo sapiens (Human))
BDBM194880
(US9206184, 61)
Show SMILES COc1cc(C)cc2cc(sc12)-c1c(-c2cnco2)c(CN2CCNCC2)n2ncnc(N)c12
Show InChI InChI=1S/C24H25N7O2S/c1-14-7-15-9-19(34-23(15)17(8-14)32-2)21-20(18-10-27-13-33-18)16(11-30-5-3-26-4-6-30)31-22(21)24(25)28-12-29-31/h7-10,12-13,26H,3-6,11H2,1-2H3,(H2,25,28,29)
NCI pathway
Reactome pathway
US Patent
n/an/a 0.5n/an/an/an/a7.022
BAYER INTELLECTUAL PROPERTY GmbH
US Patent
Assay Description
For the assay, 50 nl of each stock solution of the test compound in DMSO was pipetted into a black, low-volume 384-well microtiter plate (Greiner Bio...
US Patent US9206184 (2015)
BindingDB Entry DOI: 10.7270/Q2SN07SH