BDBM195600 US9216974, WC-5-1
SMILES: O=c1ccc2nc3ccc(OC#C)cc3oc2c1
InChI Key: InChIKey=HFKUUXRENJLWLQ-UHFFFAOYSA-N
Data: 1 KI  1 Kd
Activity Spreadsheet -- Enzyme Inhibition Constant Data from BindingDB
Found 2 hits for monomerid = 195600
Trg + Lig
Ki
nM
ΔG°
kcal/mole
IC50
nM
Kd
nM
EC50/IC50
nM
koff
s-1
kon
M-1s-1
pHTemp
°C
Beta amyloid A4 protein
(Homo sapiens (Human))
BDBM195600
(US9216974, WC-5-1)
Show SMILES O=c1ccc2nc3ccc(OC#C)cc3oc2c1
Show InChI InChI=1S/C14H7NO3/c1-2-17-10-4-6-12-14(8-10)18-13-7-9(16)3-5-11(13)15-12/h1,3-8H
Reactome pathway
US Patent
4.61E+3n/an/an/an/an/an/an/an/a
WASHINGTON UNIVERSITY
US Patent
Assay Description
To determine the Ki values, fixed brain tissues prepared from 15-month-old Tg2576 mice (N=5) will be incubated for 30 min with 1 μM methoxy-X34 ...
US Patent US9216974 (2015)
BindingDB Entry DOI: 10.7270/Q2WD3ZCG
Beta amyloid A4 protein
(Homo sapiens (Human))
BDBM195600
(US9216974, WC-5-1)
Show SMILES O=c1ccc2nc3ccc(OC#C)cc3oc2c1
Show InChI InChI=1S/C14H7NO3/c1-2-17-10-4-6-12-14(8-10)18-13-7-9(16)3-5-11(13)15-12/h1,3-8H
Reactome pathway
US Patent
n/an/an/a 828n/an/an/an/an/a
WASHINGTON UNIVERSITY
US Patent
Assay Description
To determine the Ki values, fixed brain tissues prepared from 15-month-old Tg2576 mice (N=5) will be incubated for 30 min with 1 μM methoxy-X34 ...
US Patent US9216974 (2015)
BindingDB Entry DOI: 10.7270/Q2WD3ZCG