BDBM19734 2-Cyano-pyrimidine, 16d::2-cyano-4-(cyclohexylamino)-N-{2-[4-(pyrrolidin-1-yl)phenyl]ethyl}pyrimidine-5-carboxamide
SMILES: O=C(NCCc1ccc(cc1)N1CCCC1)c1cnc(nc1NC1CCCCC1)C#N
InChI Key: InChIKey=RLZJPYQRSZCAJD-UHFFFAOYSA-N
Data: 3 IC50
Activity Spreadsheet -- Enzyme Inhibition Constant Data from BindingDB
Found 3 hits for monomerid = 19734
Trg + Lig
Ki
nM
ΔG°
kcal/mole
IC50
nM
Kd
nM
EC50/IC50
nM
koff
s-1
kon
M-1s-1
pHTemp
°C
Cathepsin K
(Homo sapiens (Human))
BDBM19734
(2-Cyano-pyrimidine, 16d | 2-cyano-4-(cyclohexylami...)
Show SMILES O=C(NCCc1ccc(cc1)N1CCCC1)c1cnc(nc1NC1CCCCC1)C#N
Show InChI InChI=1S/C24H30N6O/c25-16-22-27-17-21(23(29-22)28-19-6-2-1-3-7-19)24(31)26-13-12-18-8-10-20(11-9-18)30-14-4-5-15-30/h8-11,17,19H,1-7,12-15H2,(H,26,31)(H,27,28,29)
Reactome pathway
n/an/a 0.75n/an/an/an/a7.022
Novartis Pharmaceuticals
Assay Description
The substrate hydrolysis with or without inhibitor was monitored at an excitation wavelength of 360nm and an emission wavelength of 460 nm on a fluor...
J Med Chem 50: 591-4 (2007)
Article DOI: 10.1021/jm0613525
BindingDB Entry DOI: 10.7270/Q22805X5
Cathepsin S
(Homo sapiens (Human))
BDBM19734
(2-Cyano-pyrimidine, 16d | 2-cyano-4-(cyclohexylami...)
Show SMILES O=C(NCCc1ccc(cc1)N1CCCC1)c1cnc(nc1NC1CCCCC1)C#N
Show InChI InChI=1S/C24H30N6O/c25-16-22-27-17-21(23(29-22)28-19-6-2-1-3-7-19)24(31)26-13-12-18-8-10-20(11-9-18)30-14-4-5-15-30/h8-11,17,19H,1-7,12-15H2,(H,26,31)(H,27,28,29)
Reactome pathway
n/an/a 2.30n/an/an/an/an/an/a
Novartis Pharmaceuticals
Assay Description
The substrate hydrolysis with or without inhibitor was monitored at an excitation wavelength of 360nm and an emission wavelength of 460 nm on a fluor...
J Med Chem 50: 591-4 (2007)
Article DOI: 10.1021/jm0613525
BindingDB Entry DOI: 10.7270/Q22805X5
Procathepsin L
(Homo sapiens (Human))
BDBM19734
(2-Cyano-pyrimidine, 16d | 2-cyano-4-(cyclohexylami...)
Show SMILES O=C(NCCc1ccc(cc1)N1CCCC1)c1cnc(nc1NC1CCCCC1)C#N
Show InChI InChI=1S/C24H30N6O/c25-16-22-27-17-21(23(29-22)28-19-6-2-1-3-7-19)24(31)26-13-12-18-8-10-20(11-9-18)30-14-4-5-15-30/h8-11,17,19H,1-7,12-15H2,(H,26,31)(H,27,28,29)
Reactome pathway
n/an/a 5.10n/an/an/an/a5.522
Novartis Pharmaceuticals
Assay Description
The substrate hydrolysis with or without inhibitor was monitored at an excitation wavelength of 360nm and an emission wavelength of 460 nm on a fluor...
J Med Chem 50: 591-4 (2007)
Article DOI: 10.1021/jm0613525
BindingDB Entry DOI: 10.7270/Q22805X5