BDBM20059 5-Substituted-6-chlorouracil, 5f::6-chloro-5-heptyl-1,2,3,4-tetrahydropyrimidine-2,4-dione
SMILES: CCCCCCCc1c(Cl)[nH]c(=O)[nH]c1=O
InChI Key: InChIKey=CIAJCIKDDKGJBP-UHFFFAOYSA-N
Data: 1 KI
Activity Spreadsheet -- Enzyme Inhibition Constant Data from BindingDB
Found 1 hit for monomerid = 20059
Trg + Lig
Ki
nM
ΔG°
kcal/mole
IC50
nM
Kd
nM
EC50/IC50
nM
koff
s-1
kon
M-1s-1
pHTemp
°C
Thymidine Phosphorylase (TP)
(Homo sapiens (Human))
BDBM20059
(5-Substituted-6-chlorouracil, 5f | 6-chloro-5-hept...)
Show SMILES CCCCCCCc1c(Cl)[nH]c(=O)[nH]c1=O
Show InChI InChI=1S/C11H17ClN2O2/c1-2-3-4-5-6-7-8-9(12)13-11(16)14-10(8)15/h2-7H2,1H3,(H2,13,14,15,16)
Reactome pathway
1.06E+3 -8.47n/an/an/an/an/a6.437
Gilead Sciences Inc.
Assay Description
The enzyme reaction was started by the addition of enzyme to the reaction mixture containing substrate and test compounds. The reaction was stopped b...
J Med Chem 50: 6016-23 (2007)
Article DOI: 10.1021/jm070644i
BindingDB Entry DOI: 10.7270/Q2M043PX