BDBM20504 1-(2-bromophenyl)-3-[(3R)-1-[5-(trifluoromethyl)pyridin-2-yl]pyrrolidin-3-yl]urea::BMCL163287 Compound 15::SB-705498
SMILES: FC(F)(F)c1ccc(nc1)N1CC[C@H](C1)NC(=O)Nc1ccccc1Br
InChI Key: InChIKey=JYILLRHXRVTRSH-GFCCVEGCSA-N
Data: 2 IC50  1 EC50
Activity Spreadsheet -- Enzyme Inhibition Constant Data from BindingDB
Found 3 hits for monomerid = 20504
Trg + Lig
Ki
nM
ΔG°
kcal/mole
IC50
nM
Kd
nM
EC50/IC50
nM
koff
s-1
kon
M-1s-1
pHTemp
°C
Transient receptor potential cation channel subfamily V member 1
(Homo sapiens (Human))
BDBM20504
(1-(2-bromophenyl)-3-[(3R)-1-[5-(trifluoromethyl)py...)
Show SMILES FC(F)(F)c1ccc(nc1)N1CC[C@H](C1)NC(=O)Nc1ccccc1Br |r|
Show InChI InChI=1S/C17H16BrF3N4O/c18-13-3-1-2-4-14(13)24-16(26)23-12-7-8-25(10-12)15-6-5-11(9-22-15)17(19,20)21/h1-6,9,12H,7-8,10H2,(H2,23,24,26)/t12-/m1/s1
Reactome pathway
n/an/an/an/a 32n/an/a7.225
GSK
Assay Description
One day before the assay was performed, human TRPV1 expressed in 1321N1 astrocytoma cells were plated onto 96-well assay plates and grown until 2.5 h...
Bioorg Med Chem Lett 16: 3287-91 (2006)
Article DOI: 10.1016/j.bmcl.2006.03.030
BindingDB Entry DOI: 10.7270/Q2125QX9
Transient receptor potential cation channel subfamily V member 1
(Homo sapiens (Human))
BDBM20504
(1-(2-bromophenyl)-3-[(3R)-1-[5-(trifluoromethyl)py...)
Show SMILES FC(F)(F)c1ccc(nc1)N1CC[C@H](C1)NC(=O)Nc1ccccc1Br |r|
Show InChI InChI=1S/C17H16BrF3N4O/c18-13-3-1-2-4-14(13)24-16(26)23-12-7-8-25(10-12)15-6-5-11(9-22-15)17(19,20)21/h1-6,9,12H,7-8,10H2,(H2,23,24,26)/t12-/m1/s1
Reactome pathway
n/an/a 100n/an/an/an/an/an/a
Astellas Pharma Inc
Curated by ChEMBL
Assay Description
Displacement of [3H]RTX from human TRPV1 expressed in HEK293 cell membranes after 60 mins by scintillation counting method
Bioorg Med Chem 26: 3716-3726 (2018)
Article DOI: 10.1016/j.bmc.2018.06.001
BindingDB Entry DOI: 10.7270/Q2FX7D0K
Vanilloid receptor
(Rattus norvegicus (rat))
BDBM20504
(1-(2-bromophenyl)-3-[(3R)-1-[5-(trifluoromethyl)py...)
Show SMILES FC(F)(F)c1ccc(nc1)N1CC[C@H](C1)NC(=O)Nc1ccccc1Br |r|
Show InChI InChI=1S/C17H16BrF3N4O/c18-13-3-1-2-4-14(13)24-16(26)23-12-7-8-25(10-12)15-6-5-11(9-22-15)17(19,20)21/h1-6,9,12H,7-8,10H2,(H2,23,24,26)/t12-/m1/s1
Reactome pathway
n/an/a 32n/an/an/an/an/an/a
Neurogen Corporation
Curated by ChEMBL
Assay Description
Inhibition of rat TRPV1
J Med Chem 53: 3330-48 (2010)
Article DOI: 10.1021/jm100051g
BindingDB Entry DOI: 10.7270/Q2474BTP