BDBM205066 US9556132, 30::process for preparing (e)-n-[(2-{2-[1-(2-fluorophenyl)-1h-1,2,3,4-tetrazol-5-yl]phenyl}phenyl)methylidene]hydroxylamine
SMILES: O\N=C/c1ccccc1-c1ccccc1-c1nnnn1-c1ccccc1F
InChI Key: InChIKey=RAYPYMSGHQSSCY-XKZIYDEJSA-N
Data: 1 IC50
Activity Spreadsheet -- Enzyme Inhibition Constant Data from BindingDB
Found 1 hit for monomerid = 205066
Trg + Lig
Ki
nM
ΔG°
kcal/mole
IC50
nM
Kd
nM
EC50/IC50
nM
koff
s-1
kon
M-1s-1
pHTemp
°C
Intermediate conductance calcium-activated potassium channel protein 4
(Homo sapiens (Human))
BDBM205066
(US9556132, 30 | process for preparing (e)-n-[(2-{2...)
Show SMILES O\N=C/c1ccccc1-c1ccccc1-c1nnnn1-c1ccccc1F
Show InChI InChI=1S/C20H14FN5O/c21-18-11-5-6-12-19(18)26-20(23-24-25-26)17-10-4-3-9-16(17)15-8-2-1-7-14(15)13-22-27/h1-13,27H/b22-13-
Reactome pathway
US Patent
n/an/a 57n/an/an/an/a7.3n/a
Saniona A/S
US Patent
Assay Description
Human HEK293 cells over-expressing human IK are grown in culture medium (DMEM supplemented with 10% foetal bovine serum), in polystyrene culture flas...
US Patent US9556132 (2017)
BindingDB Entry DOI: 10.7270/Q2SF2Z5T