BDBM20624 (1S,10R,11S,14R,15S)-15-methyltetracyclo[8.7.0.0^{2,7}.0^{11,15}]heptadeca-2(7),3,5-triene-5,14-diol::17alpha-estradiol
SMILES: [H][C@@]12CC[C@@H](O)[C@@]1(C)CC[C@]1([H])c3ccc(O)cc3CC[C@@]21[H]
InChI Key: InChIKey=VOXZDWNPVJITMN-SFFUCWETSA-N
Data: 3 IC50  2 EC50
PDB links: 21 PDB IDs match this monomer. 13 PDB IDs contain this monomer as substructures. 13 PDB IDs contain inhibitors having a similarity of 90% to this monomer.
Activity Spreadsheet -- Enzyme Inhibition Constant Data from BindingDB
Found 3 hits for monomerid = 20624
Trg + Lig
Ki
nM
ΔG°
kcal/mole
IC50
nM
Kd
nM
EC50/IC50
nM
koff
s-1
kon
M-1s-1
pHTemp
°C
Estrogen receptor
(Homo sapiens (Human))
BDBM20624
((1S,10R,11S,14R,15S)-15-methyltetracyclo[8.7.0.0^{...)
Show SMILES [H][C@@]12CC[C@@H](O)[C@@]1(C)CC[C@]1([H])c3ccc(O)cc3CC[C@@]21[H]
Show InChI InChI=1S/C18H24O2/c1-18-9-8-14-13-5-3-12(19)10-11(13)2-4-15(14)16(18)6-7-17(18)20/h3,5,10,14-17,19-20H,2,4,6-9H2,1H3/t14-,15-,16+,17-,18+/m1/s1
n/an/a 570n/a 1.5n/an/a7.422
Novartis Pharmaceuticals
Assay Description
Radioligand binding assay was performed by using 96-well microtiterplates containing ER, 17beta-estradiol, and the test compound to be tested and SPA...
J Med Chem 45: 1399-401 (2002)
Article DOI: 10.1021/jm015577l
BindingDB Entry DOI: 10.7270/Q27M0665
3D
3D Structure (crystal)
Androgen receptor
(Rattus norvegicus (Rat))
BDBM20624
((1S,10R,11S,14R,15S)-15-methyltetracyclo[8.7.0.0^{...)
Show SMILES [H][C@@]12CC[C@@H](O)[C@@]1(C)CC[C@]1([H])c3ccc(O)cc3CC[C@@]21[H]
Show InChI InChI=1S/C18H24O2/c1-18-9-8-14-13-5-3-12(19)10-11(13)2-4-15(14)16(18)6-7-17(18)20/h3,5,10,14-17,19-20H,2,4,6-9H2,1H3/t14-,15-,16+,17-,18+/m1/s1
Reactome pathway
n/an/a 7.59E+4n/an/an/an/an/an/a
University of Basel
Curated by ChEMBL
Assay Description
Inhibitory concentration against recombinant rat androgen receptor expressed in Escherichia coli using [3H]methyltrienolone (R 1881)
J Med Chem 48: 5666-74 (2005)
Article DOI: 10.1021/jm050403f
BindingDB Entry DOI: 10.7270/Q2TM7CBZ
Estradiol receptor beta (ERβ)
(Homo sapiens (Human))
BDBM20624
((1S,10R,11S,14R,15S)-15-methyltetracyclo[8.7.0.0^{...)
Show SMILES [H][C@@]12CC[C@@H](O)[C@@]1(C)CC[C@]1([H])c3ccc(O)cc3CC[C@@]21[H]
Show InChI InChI=1S/C18H24O2/c1-18-9-8-14-13-5-3-12(19)10-11(13)2-4-15(14)16(18)6-7-17(18)20/h3,5,10,14-17,19-20H,2,4,6-9H2,1H3/t14-,15-,16+,17-,18+/m1/s1
n/an/a 1.23E+3n/a 4.5n/an/a7.422
Novartis Pharmaceuticals
Assay Description
Radioligand binding assay was performed by using 96-well microtiterplates containing ER, 17beta-estradiol, and the test compound to be tested and SPA...
J Med Chem 45: 1399-401 (2002)
Article DOI: 10.1021/jm015577l
BindingDB Entry DOI: 10.7270/Q27M0665
3D
3D Structure (crystal)