BDBM208993 US9233167, a-6-mPEG4-O-Hydroxycodone
SMILES: COCCOCCOCCOCCO[C@H]1CC[C@@]2(O)C3Cc4ccc(OC)c5O[C@@H]1[C@]2(CCN3C)c45
InChI Key: InChIKey=HPPMBTAPZKSKLS-WMFZPKMRSA-N
Data: 1 KI  1 EC50
Activity Spreadsheet -- Enzyme Inhibition Constant Data from BindingDB
Found 2 hits for monomerid = 208993
Trg + Lig
Ki
nM
ΔG°
kcal/mole
IC50
nM
Kd
nM
EC50/IC50
nM
koff
s-1
kon
M-1s-1
pHTemp
°C
Mu-type opioid receptor
(Homo sapiens (Human))
BDBM208993
(US9233167, a-6-mPEG4-O-Hydroxycodone)
Show SMILES COCCOCCOCCOCCO[C@H]1CC[C@@]2(O)C3Cc4ccc(OC)c5O[C@@H]1[C@]2(CCN3C)c45 |r,TLB:27:35:17:33.31.32,22:21:17:33.31.32|
Show InChI InChI=1S/C27H41NO8/c1-28-9-8-26-23-19-4-5-20(31-3)24(23)36-25(26)21(6-7-27(26,29)22(28)18-19)35-17-16-34-15-14-33-13-12-32-11-10-30-2/h4-5,21-22,25,29H,6-18H2,1-3H3/t21-,22?,25-,26-,27+/m0/s1
NCI pathway
Reactome pathway
US Patent
893 -8.25n/an/an/an/an/an/a25
Nektar Therapeutics
US Patent
Assay Description
Briefly, serial dilutions of the test compounds were placed in a 96-well plate to which were added SPA beads, membrane and radioligand. The assay con...
US Patent US9233167 (2016)
BindingDB Entry DOI: 10.7270/Q25T3J97
Mu-type opioid receptor
(Homo sapiens (Human))
BDBM208993
(US9233167, a-6-mPEG4-O-Hydroxycodone)
Show SMILES COCCOCCOCCOCCO[C@H]1CC[C@@]2(O)C3Cc4ccc(OC)c5O[C@@H]1[C@]2(CCN3C)c45 |r,TLB:27:35:17:33.31.32,22:21:17:33.31.32|
Show InChI InChI=1S/C27H41NO8/c1-28-9-8-26-23-19-4-5-20(31-3)24(23)36-25(26)21(6-7-27(26,29)22(28)18-19)35-17-16-34-15-14-33-13-12-32-11-10-30-2/h4-5,21-22,25,29H,6-18H2,1-3H3/t21-,22?,25-,26-,27+/m0/s1
NCI pathway
Reactome pathway
US Patent
n/an/an/an/a 3.72E+3n/an/an/a25
Nektar Therapeutics
US Patent
Assay Description
Briefly, suspensions of cells expressing either the mu, kappa or delta opioid receptors were prepared in buffer containing 0.5 mM isobutyl-methyl xan...
US Patent US9233167 (2016)
BindingDB Entry DOI: 10.7270/Q25T3J97