null
SMILES: Cc1cc(N)nc(C)c1CNC(=O)c1cnn(Cc2ccc(Cn3ccccc3=O)cc2)c1
InChI Key: InChIKey=LAHWWHTYCCSIGH-UHFFFAOYSA-N
Activity Spreadsheet -- Enzyme Inhibition Constant Data from BindingDB
Found 1 hit for monomerid = 212110
Trg + Lig
Ki
nM
ΔG°
kcal/mole
IC50
nM
Kd
nM
EC50/IC50
nM
koff
s-1
kon
M-1s-1
pHTemp
°C
Plasma kallikrein
(Homo sapiens (Human))
BDBM212110
(US9290485, 142)
Show SMILES Cc1cc(N)nc(C)c1CNC(=O)c1cnn(Cc2ccc(Cn3ccccc3=O)cc2)c1
Show InChI InChI=1S/C25H26N6O2/c1-17-11-23(26)29-18(2)22(17)13-27-25(33)21-12-28-31(16-21)15-20-8-6-19(7-9-20)14-30-10-4-3-5-24(30)32/h3-12,16H,13-15H2,1-2H3,(H2,26,29)(H,27,33)
US Patent
n/an/a 0.0224n/an/an/an/a7.825
NOVARTIS AG
US Patent
Assay Description
Enzymatic reactions were conducted in â¿¿assay bufferâ¿¿, comprising 50 mM Hepes/NaOH at pH 7.8, 150 mM NaCl, 1 mM EDTA and 0.05% (w/v) CHAPS. For th...
US Patent US9290485 (2016)
BindingDB Entry DOI: 10.7270/Q26H4G73