BDBM214472 US9283222, 576
SMILES: Fc1ccc(Cc2n[nH]c(=O)c3CCCCc23)cc1C(=O)N1CCN(CC1)C(=O)N1CCCC1
InChI Key: InChIKey=IMHLDMWJSSSQBI-UHFFFAOYSA-N
Data: 1 KI
Activity Spreadsheet -- Enzyme Inhibition Constant Data from BindingDB
Found 1 hit for monomerid = 214472
Trg + Lig
Ki
nM
ΔG°
kcal/mole
IC50
nM
Kd
nM
EC50/IC50
nM
koff
s-1
kon
M-1s-1
pHTemp
°C
Poly [ADP-ribose] polymerase 1
(Homo sapiens (Human))
BDBM214472
(US9283222, 576)
Show SMILES Fc1ccc(Cc2n[nH]c(=O)c3CCCCc23)cc1C(=O)N1CCN(CC1)C(=O)N1CCCC1
Show InChI InChI=1S/C25H30FN5O3/c26-21-8-7-17(16-22-18-5-1-2-6-19(18)23(32)28-27-22)15-20(21)24(33)29-11-13-31(14-12-29)25(34)30-9-3-4-10-30/h7-8,15H,1-6,9-14,16H2,(H,28,32)
US Patent
0.900n/an/an/an/an/an/a8.0n/a
AbbVie Inc.
US Patent
Assay Description
PARP1 assay was conducted in PARP assay buffer containing 50 mM Tris pH 8.0, 1 mM DTT, 4 mM MgCl2. PARP reactions contained 1.5 uM [3H]-NAD+ (1.6 uCi...
US Patent US9283222 (2016)
BindingDB Entry DOI: 10.7270/Q2BZ64XD