BDBM214519 US9283222, 632
SMILES: Fc1ccc(Cc2n[nH]c(=O)c3CCCNc23)cc1C(=O)N1CCN(CC1)c1ncncn1
InChI Key: InChIKey=WRNLDONUDVOSBO-UHFFFAOYSA-N
Data: 1 KI
Activity Spreadsheet -- Enzyme Inhibition Constant Data from BindingDB
Found 1 hit for monomerid = 214519
Trg + Lig
Ki
nM
ΔG°
kcal/mole
IC50
nM
Kd
nM
EC50/IC50
nM
koff
s-1
kon
M-1s-1
pHTemp
°C
Poly [ADP-ribose] polymerase 1
(Homo sapiens (Human))
BDBM214519
(US9283222, 632)
Show SMILES Fc1ccc(Cc2n[nH]c(=O)c3CCCNc23)cc1C(=O)N1CCN(CC1)c1ncncn1
Show InChI InChI=1S/C22H23FN8O2/c23-17-4-3-14(11-18-19-15(2-1-5-25-19)20(32)29-28-18)10-16(17)21(33)30-6-8-31(9-7-30)22-26-12-24-13-27-22/h3-4,10,12-13,25H,1-2,5-9,11H2,(H,29,32)
US Patent
0.900n/an/an/an/an/an/a8.0n/a
AbbVie Inc.
US Patent
Assay Description
PARP1 assay was conducted in PARP assay buffer containing 50 mM Tris pH 8.0, 1 mM DTT, 4 mM MgCl2. PARP reactions contained 1.5 uM [3H]-NAD+ (1.6 uCi...
US Patent US9283222 (2016)
BindingDB Entry DOI: 10.7270/Q2BZ64XD