null
SMILES: Cn1cc(-c2cc(NS(C)(=O)=O)ccc2OC2CCOCC2)c2cc[nH]c2c1=O
InChI Key: InChIKey=OECWOMUGQVHRAA-UHFFFAOYSA-N
Activity Spreadsheet -- Enzyme Inhibition Constant Data from BindingDB
Found 4 hits for monomerid = 220440
Trg + Lig
Ki
nM
ΔG°
kcal/mole
IC50
nM
Kd
nM
EC50/IC50
nM
koff
s-1
kon
M-1s-1
pHTemp
°C
Bromodomain-containing protein 4 [57-168]
(Homo sapiens (Human))
BDBM220440
(US9296741, 29)
Show SMILES Cn1cc(-c2cc(NS(C)(=O)=O)ccc2OC2CCOCC2)c2cc[nH]c2c1=O
Show InChI InChI=1S/C20H23N3O5S/c1-23-12-17(15-5-8-21-19(15)20(23)24)16-11-13(22-29(2,25)26)3-4-18(16)28-14-6-9-27-10-7-14/h3-5,8,11-12,14,21-22H,6-7,9-10H2,1-2H3
US Patent
1.10 -12.2n/an/an/an/an/a6.025
AbbVie Inc.
US Patent
Assay Description
A time-resolved fluorescence resonance energy transfer (TR-FRET) assay was used to determine the affinities of compounds of the Examples listed in Ta...
US Patent US9296741 (2016)
BindingDB Entry DOI: 10.7270/Q26W98ZQ
Bromodomain-containing protein 4 [352-457]
(Homo sapiens (Human))
BDBM220440
(US9296741, 29)
Show SMILES Cn1cc(-c2cc(NS(C)(=O)=O)ccc2OC2CCOCC2)c2cc[nH]c2c1=O
Show InChI InChI=1S/C20H23N3O5S/c1-23-12-17(15-5-8-21-19(15)20(23)24)16-11-13(22-29(2,25)26)3-4-18(16)28-14-6-9-27-10-7-14/h3-5,8,11-12,14,21-22H,6-7,9-10H2,1-2H3
NCI pathway
Reactome pathway
US Patent
6.70 -11.1n/an/an/an/an/a6.025
AbbVie Inc.
US Patent
Assay Description
A time-resolved fluorescence resonance energy transfer (TR-FRET) assay was used to determine the affinities of compounds of the Examples listed in Ta...
US Patent US9296741 (2016)
BindingDB Entry DOI: 10.7270/Q26W98ZQ
Bromodomain-containing protein 4
(Homo sapiens (Human))
BDBM220440
(US9296741, 29)
Show SMILES Cn1cc(-c2cc(NS(C)(=O)=O)ccc2OC2CCOCC2)c2cc[nH]c2c1=O
Show InChI InChI=1S/C20H23N3O5S/c1-23-12-17(15-5-8-21-19(15)20(23)24)16-11-13(22-29(2,25)26)3-4-18(16)28-14-6-9-27-10-7-14/h3-5,8,11-12,14,21-22H,6-7,9-10H2,1-2H3
68n/an/an/an/an/an/an/an/a
AbbVie Inc.
Curated by ChEMBL
Assay Description
Binding affinity to human N-terminal His6-tagged BRD4 BD1-BD2 (K57 to K550 residues) after 1 hr using alexa-647 conjugated probe by TR-FRET assay
J Med Chem 60: 8369-8384 (2017)
Article DOI: 10.1021/acs.jmedchem.7b00746
BindingDB Entry DOI: 10.7270/Q2251MB8
Bromodomain-containing protein 4
(Homo sapiens (Human))
BDBM220440
(US9296741, 29)
Show SMILES Cn1cc(-c2cc(NS(C)(=O)=O)ccc2OC2CCOCC2)c2cc[nH]c2c1=O
Show InChI InChI=1S/C20H23N3O5S/c1-23-12-17(15-5-8-21-19(15)20(23)24)16-11-13(22-29(2,25)26)3-4-18(16)28-14-6-9-27-10-7-14/h3-5,8,11-12,14,21-22H,6-7,9-10H2,1-2H3
n/an/an/an/a 90n/an/an/an/a
AbbVie Inc.
Curated by ChEMBL
Assay Description
The compound was tested for the inhibition of fibrinogen receptor
J Med Chem 60: 8369-8384 (2017)
Article DOI: 10.1021/acs.jmedchem.7b00746
BindingDB Entry DOI: 10.7270/Q2251MB8