BDBM220679 US9296741, 268
SMILES: CCS(=O)(=O)c1ccc(OC2CCC(C)(CC2)OC)c(c1)-c1cn(C)c(=O)c2[nH]ccc12
InChI Key: InChIKey=YBTSJVRXQJTSBM-UHFFFAOYSA-N
Data: 2 KI
Activity Spreadsheet -- Enzyme Inhibition Constant Data from BindingDB
Found 2 hits for monomerid = 220679
Trg + Lig
Ki
nM
ΔG°
kcal/mole
IC50
nM
Kd
nM
EC50/IC50
nM
koff
s-1
kon
M-1s-1
pHTemp
°C
Bromodomain-containing protein 4 (BRD4)(aa 352-457)
(Homo sapiens (Human))
BDBM220679
(US9296741, 268)
Show SMILES CCS(=O)(=O)c1ccc(OC2CCC(C)(CC2)OC)c(c1)-c1cn(C)c(=O)c2[nH]ccc12 |(5.69,1.13,;6.46,2.46,;5.69,3.8,;4.92,5.13,;7.03,4.57,;4.36,3.03,;3.03,3.8,;1.69,3.03,;1.69,1.49,;.36,.72,;-.97,1.49,;-2.31,.72,;-3.64,1.49,;-3.64,3.03,;-5.18,3.08,;-2.31,3.8,;-.97,3.03,;-4.46,4.33,;-6,4.28,;3.03,.72,;4.36,1.49,;3.03,-.82,;4.36,-1.59,;4.36,-3.13,;5.69,-3.9,;3.03,-3.9,;3.03,-5.44,;1.69,-3.13,;.23,-3.61,;-.68,-2.36,;.23,-1.12,;1.69,-1.59,)|
Show InChI InChI=1S/C24H30N2O5S/c1-5-32(28,29)17-6-7-21(31-16-8-11-24(2,30-4)12-9-16)19(14-17)20-15-26(3)23(27)22-18(20)10-13-25-22/h6-7,10,13-16,25H,5,8-9,11-12H2,1-4H3
NCI pathway
Reactome pathway
US Patent
0.570 -12.6n/an/an/an/an/a6.025
AbbVie Inc.
US Patent
Assay Description
A time-resolved fluorescence resonance energy transfer (TR-FRET) assay was used to determine the affinities of compounds of the Examples listed in Ta...
US Patent US9296741 (2016)
BindingDB Entry DOI: 10.7270/Q26W98ZQ
Bromodomain-containing protein 4 (BRD4)(aa 57-168)
(Homo sapiens (Human))
BDBM220679
(US9296741, 268)
Show SMILES CCS(=O)(=O)c1ccc(OC2CCC(C)(CC2)OC)c(c1)-c1cn(C)c(=O)c2[nH]ccc12 |(5.69,1.13,;6.46,2.46,;5.69,3.8,;4.92,5.13,;7.03,4.57,;4.36,3.03,;3.03,3.8,;1.69,3.03,;1.69,1.49,;.36,.72,;-.97,1.49,;-2.31,.72,;-3.64,1.49,;-3.64,3.03,;-5.18,3.08,;-2.31,3.8,;-.97,3.03,;-4.46,4.33,;-6,4.28,;3.03,.72,;4.36,1.49,;3.03,-.82,;4.36,-1.59,;4.36,-3.13,;5.69,-3.9,;3.03,-3.9,;3.03,-5.44,;1.69,-3.13,;.23,-3.61,;-.68,-2.36,;.23,-1.12,;1.69,-1.59,)|
Show InChI InChI=1S/C24H30N2O5S/c1-5-32(28,29)17-6-7-21(31-16-8-11-24(2,30-4)12-9-16)19(14-17)20-15-26(3)23(27)22-18(20)10-13-25-22/h6-7,10,13-16,25H,5,8-9,11-12H2,1-4H3
US Patent
0.760 -12.4n/an/an/an/an/a6.025
AbbVie Inc.
US Patent
Assay Description
A time-resolved fluorescence resonance energy transfer (TR-FRET) assay was used to determine the affinities of compounds of the Examples listed in Ta...
US Patent US9296741 (2016)
BindingDB Entry DOI: 10.7270/Q26W98ZQ