BDBM224526 US10080750, Compound 204::US9321760, 204::US9662330, Compound 204
SMILES: Nc1ncnc(N2CCC(N)(CNC(=O)c3ccc(F)cc3F)C2)c1-c1cccc(F)c1
InChI Key: InChIKey=SWYWXASTFIRRGJ-UHFFFAOYSA-N
Data: 3 IC50
Activity Spreadsheet -- Enzyme Inhibition Constant Data from BindingDB
Found 3 hits for monomerid = 224526
Trg + Lig
Ki
nM
ΔG°
kcal/mole
IC50
nM
Kd
nM
EC50/IC50
nM
koff
s-1
kon
M-1s-1
pHTemp
°C
Ribosomal protein S6 kinase (P70S6K)
(Homo sapiens (Human))
BDBM224526
(US10080750, Compound 204 | US9321760, 204 | US9662...)
Show SMILES Nc1ncnc(N2CCC(N)(CNC(=O)c3ccc(F)cc3F)C2)c1-c1cccc(F)c1
Show InChI InChI=1S/C22H21F3N6O/c23-14-3-1-2-13(8-14)18-19(26)29-12-30-20(18)31-7-6-22(27,11-31)10-28-21(32)16-5-4-15(24)9-17(16)25/h1-5,8-9,12H,6-7,10-11,27H2,(H,28,32)(H2,26,29,30)
NCI pathway
Reactome pathway
US Patent
n/an/a 2.60n/an/an/an/a7.5n/a
Merck Patent GmbH
US Patent
Assay Description
P70S6K inhibitor compounds were diluted and plated in 96 well plates. A reaction mixture including the following components was then added to the com...
US Patent US9321760 (2016)
BindingDB Entry DOI: 10.7270/Q2R78D2R
Ribosomal protein S6 kinase (P70S6K)
(Homo sapiens (Human))
BDBM224526
(US10080750, Compound 204 | US9321760, 204 | US9662...)
Show SMILES Nc1ncnc(N2CCC(N)(CNC(=O)c3ccc(F)cc3F)C2)c1-c1cccc(F)c1
Show InChI InChI=1S/C22H21F3N6O/c23-14-3-1-2-13(8-14)18-19(26)29-12-30-20(18)31-7-6-22(27,11-31)10-28-21(32)16-5-4-15(24)9-17(16)25/h1-5,8-9,12H,6-7,10-11,27H2,(H,28,32)(H2,26,29,30)
NCI pathway
Reactome pathway
US Patent
n/an/a 2.60n/an/an/an/an/an/a
Merck Patent GmbH
US Patent
Assay Description
P70S6K inhibitor compounds were diluted and plated in 96 well plates. A reaction mixture including the following components was then added to the com...
US Patent US9662330 (2017)
BindingDB Entry DOI: 10.7270/Q2MK6G04
P70S6K (T412E)
(Homo sapiens (Human))
BDBM224526
(US10080750, Compound 204 | US9321760, 204 | US9662...)
Show SMILES Nc1ncnc(N2CCC(N)(CNC(=O)c3ccc(F)cc3F)C2)c1-c1cccc(F)c1
Show InChI InChI=1S/C22H21F3N6O/c23-14-3-1-2-13(8-14)18-19(26)29-12-30-20(18)31-7-6-22(27,11-31)10-28-21(32)16-5-4-15(24)9-17(16)25/h1-5,8-9,12H,6-7,10-11,27H2,(H,28,32)(H2,26,29,30)
US Patent
n/an/a 2.60n/an/an/an/a7.5n/a
Merck Patent GmbH
US Patent
Assay Description
P70S6K inhibitor compounds were diluted and plated in 96 well plates. A reaction mixture including the following components was then added to the com...
US Patent US10080750 (2018)
BindingDB Entry DOI: 10.7270/Q2WS8W9F