BDBM224772 US9328120, 2
SMILES: Cc1nc(oc1C)[C@@H]1CC[C@H]1c1nc2n(ncc2c(=O)[nH]1)C1CCOCC1
InChI Key:
Data: 1 IC50
Activity Spreadsheet -- Enzyme Inhibition Constant Data from BindingDB
Found 1 hit for monomerid = 224772
Trg + Lig
Ki
nM
ΔG°
kcal/mole
IC50
nM
Kd
nM
EC50/IC50
nM
koff
s-1
kon
M-1s-1
pHTemp
°C
Phosphodiesterase 9A (PDE9A2)
(Homo sapiens (Human))
BDBM224772
(US9328120, 2)
Show SMILES Cc1nc(oc1C)[C@@H]1CC[C@H]1c1nc2n(ncc2c(=O)[nH]1)C1CCOCC1 |r|
US Patent
n/an/a 5n/an/an/an/an/a25
Boehringer Ingelheim International GmbH
US Patent
Assay Description
The PDE9A2 enzymatic activity assay was run as scintillation proximity assay (SPA), in general according to the protocol of the manufacturer (GE Heal...
US Patent US9328120 (2016)
BindingDB Entry DOI: 10.7270/Q2V123MS