BDBM225885 MAP02
SMILES: CN1CCN(CC1)c1ccc(cc1)-c1cnc2[nH]c3c(C)nc(nc3c2c1)-c1cnn(C)c1
InChI Key: InChIKey=HXIPOURWZRATPT-UHFFFAOYSA-N
Data: 1 KI  1 IC50
Activity Spreadsheet -- Enzyme Inhibition Constant Data from BindingDB
Found 1 hit for monomerid = 225885
Trg + Lig
Ki
nM
ΔG°
kcal/mole
IC50
nM
Kd
nM
EC50/IC50
nM
koff
s-1
kon
M-1s-1
pHTemp
°C
Mitogen-activated protein kinase kinase kinase kinase 4
(Homo sapiens (Human))
BDBM225885
(MAP02)
Show SMILES CN1CCN(CC1)c1ccc(cc1)-c1cnc2[nH]c3c(C)nc(nc3c2c1)-c1cnn(C)c1
Show InChI InChI=1S/C25H26N8/c1-16-22-23(30-24(28-16)19-14-27-32(3)15-19)21-12-18(13-26-25(21)29-22)17-4-6-20(7-5-17)33-10-8-31(2)9-11-33/h4-7,12-15H,8-11H2,1-3H3,(H,26,29)
NCI pathway
Reactome pathway
D3R
2.20n/a 5.84n/an/an/an/an/an/a
D3R
Assay Description
Z'Lyte Assay
D3R 409: (2016)
BindingDB Entry DOI: 10.7270/Q2R49PN1