null
SMILES: OC(=O)c1ccc(NC(=O)[C@H](C2CCCCC2)n2c(nc3cc(F)c(F)cc23)-c2ccc(cc2)-c2nccs2)cc1
InChI Key: InChIKey=DUGIQUVAQZHWSE-MHZLTWQESA-N
PDB links: 1 PDB ID matches this monomer.
Activity Spreadsheet -- Enzyme Inhibition Constant Data from BindingDB
Found 1 hit for monomerid = 225946
Trg + Lig
Ki
nM
ΔG°
kcal/mole
IC50
nM
Kd
nM
EC50/IC50
nM
koff
s-1
kon
M-1s-1
pHTemp
°C
Bile acid receptor
(Homo sapiens (Human))
BDBM225946
(FXR_36)
Show SMILES OC(=O)c1ccc(NC(=O)[C@H](C2CCCCC2)n2c(nc3cc(F)c(F)cc23)-c2ccc(cc2)-c2nccs2)cc1
Show InChI InChI=1S/C31H26F2N4O3S/c32-23-16-25-26(17-24(23)33)37(28(36-25)19-6-8-20(9-7-19)30-34-14-15-41-30)27(18-4-2-1-3-5-18)29(38)35-22-12-10-21(11-13-22)31(39)40/h6-18,27H,1-5H2,(H,35,38)(H,39,40)/t27-/m0/s1
NCI pathway
Reactome pathway
D3R
n/an/a 48.7n/an/an/an/a7.4n/a
D3R
Assay Description
The assay buffer contained 50 mM HEPES (pH 7.4), 10 mM NaCl, 5 mM MgCl2 and 0.01% CHAPS. The reactions were incubated for 30 min in the presence of [...
D3R 882: (2017)
BindingDB Entry DOI: 10.7270/Q2MC8XWV
3D
3D Structure (crystal)