null
SMILES: OC(=O)c1ccc(NC(=O)c2c3CN(CCc3nn2-c2ccccc2)S(=O)(=O)c2cccs2)cc1
InChI Key: InChIKey=NAXRPVGWRCOXEE-UHFFFAOYSA-N
Activity Spreadsheet -- Enzyme Inhibition Constant Data from BindingDB
Found 1 hit for monomerid = 226008
Trg + Lig
Ki
nM
ΔG°
kcal/mole
IC50
nM
Kd
nM
EC50/IC50
nM
koff
s-1
kon
M-1s-1
pHTemp
°C
Bile acid receptor
(Homo sapiens (Human))
BDBM226008
(FXR_101)
Show SMILES OC(=O)c1ccc(NC(=O)c2c3CN(CCc3nn2-c2ccccc2)S(=O)(=O)c2cccs2)cc1
Show InChI InChI=1S/C24H20N4O5S2/c29-23(25-17-10-8-16(9-11-17)24(30)31)22-19-15-27(35(32,33)21-7-4-14-34-21)13-12-20(19)26-28(22)18-5-2-1-3-6-18/h1-11,14H,12-13,15H2,(H,25,29)(H,30,31)
NCI pathway
Reactome pathway
D3R
n/an/a 2.76E+4n/an/an/an/a7.4n/a
D3R
Assay Description
The assay buffer contained 50 mM HEPES (pH 7.4), 10 mM NaCl, 5 mM MgCl2 and 0.01% CHAPS. The reactions were incubated for 30 min in the presence of [...
D3R 882: (2017)
BindingDB Entry DOI: 10.7270/Q2MC8XWV