BDBM226929 US9328096, 617
SMILES: Nc1cc(CNC(=O)c2cc(NC(=O)c3cc(c(Cl)cc3Cl)-c3ccccn3)n(n2)-c2ccccc2)ccn1
InChI Key: InChIKey=FJAXVBYXGQEASX-UHFFFAOYSA-N
Data: 1 IC50
Activity Spreadsheet -- Enzyme Inhibition Constant Data from BindingDB
Found 1 hit for monomerid = 226929
Trg + Lig
Ki
nM
ΔG°
kcal/mole
IC50
nM
Kd
nM
EC50/IC50
nM
koff
s-1
kon
M-1s-1
pHTemp
°C
Tyrosine kinase receptor A (TrkA)
(Homo sapiens (Human))
BDBM226929
(US9328096, 617)
Show SMILES Nc1cc(CNC(=O)c2cc(NC(=O)c3cc(c(Cl)cc3Cl)-c3ccccn3)n(n2)-c2ccccc2)ccn1
Show InChI InChI=1S/C28H21Cl2N7O2/c29-21-14-22(30)20(13-19(21)23-8-4-5-10-32-23)27(38)35-26-15-24(36-37(26)18-6-2-1-3-7-18)28(39)34-16-17-9-11-33-25(31)12-17/h1-15H,16H2,(H2,31,33)(H,34,39)(H,35,38)
US Patent
n/an/a 1.17n/an/an/an/an/a37
Pfizer Inc.
US Patent
Assay Description
TRKA co-expressed with p75: The assays are based upon DiscoveRx's proprietary Enzyme Fragment Complementation (EFC) technology. In the case of the TR...
US Patent US9328096 (2016)
BindingDB Entry DOI: 10.7270/Q2FN152J