BDBM228491 US9340521, E043
SMILES: CCc1ccc(Cc2cc([C@@H]3O[C@H](CO)[C@@H](O)[C@H](O)[C@H]3O)c3CCCCc3c2Cl)cc1
InChI Key: InChIKey=MSUCWDRRTZAFOI-HFBCXCLPSA-N
Data: 2 IC50
Activity Spreadsheet -- Enzyme Inhibition Constant Data from BindingDB
Found 2 hits for monomerid = 228491
Trg + Lig
Ki
nM
ΔG°
kcal/mole
IC50
nM
Kd
nM
EC50/IC50
nM
koff
s-1
kon
M-1s-1
pHTemp
°C
Sodium/glucose cotransporter 1 (SGLT1)
(Homo sapiens (Human))
BDBM228491
(US9340521, E043)
Show SMILES CCc1ccc(Cc2cc([C@@H]3O[C@H](CO)[C@@H](O)[C@H](O)[C@H]3O)c3CCCCc3c2Cl)cc1 |r|
Show InChI InChI=1S/C25H31ClO5/c1-2-14-7-9-15(10-8-14)11-16-12-19(17-5-3-4-6-18(17)21(16)26)25-24(30)23(29)22(28)20(13-27)31-25/h7-10,12,20,22-25,27-30H,2-6,11,13H2,1H3/t20-,22-,23+,24-,25+/m1/s1
US Patent
n/an/a 32.6n/an/an/an/a7.437
GREEN CROSS CORPORATION
US Patent
Assay Description
For sodium-dependent glucose transport assay, cells expressing hSGLT1 were seeded into a 96-well culture plate at a density of 5×104 cells/well...
US Patent US9340521 (2016)
BindingDB Entry DOI: 10.7270/Q2TQ60CH
Sodium/glucose cotransporter 2
(Homo sapiens (Human))
BDBM228491
(US9340521, E043)
Show SMILES CCc1ccc(Cc2cc([C@@H]3O[C@H](CO)[C@@H](O)[C@H](O)[C@H]3O)c3CCCCc3c2Cl)cc1 |r|
Show InChI InChI=1S/C25H31ClO5/c1-2-14-7-9-15(10-8-14)11-16-12-19(17-5-3-4-6-18(17)21(16)26)25-24(30)23(29)22(28)20(13-27)31-25/h7-10,12,20,22-25,27-30H,2-6,11,13H2,1H3/t20-,22-,23+,24-,25+/m1/s1
US Patent
n/an/a 0.490n/an/an/an/a7.437
GREEN CROSS CORPORATION
US Patent
Assay Description
For sodium-dependent glucose transport assay, cells expressing hSGLT2 were seeded into a 96-well culture plate at a density of 5×104 cells/well...
US Patent US9340521 (2016)
BindingDB Entry DOI: 10.7270/Q2TQ60CH