BDBM22862 2-(2-methyl-1H-imidazol-4-yl)ethan-1-amine::2-Methylhistamine
SMILES: Cc1ncc(CCN)[nH]1
InChI Key: InChIKey=XDKYTXBAVJELDQ-UHFFFAOYSA-N
Data: 2 KI  2 EC50
Activity Spreadsheet -- Enzyme Inhibition Constant Data from BindingDB
Found 4 hits for monomerid = 22862
Trg + Lig
Ki
nM
ΔG°
kcal/mole
IC50
nM
Kd
nM
EC50/IC50
nM
koff
s-1
kon
M-1s-1
pHTemp
°C
Histamine H4 receptor
(Homo sapiens (Human))
BDBM22862
(2-(2-methyl-1H-imidazol-4-yl)ethan-1-amine | 2-Met...)
Show SMILES Cc1ncc(CCN)[nH]1
Show InChI InChI=1S/C6H11N3/c1-5-8-4-6(9-5)2-3-7/h4H,2-3,7H2,1H3,(H,8,9)
Reactome pathway
794 -8.65n/an/an/an/an/a7.437
Vrije Universiteit Amsterdam
Assay Description
Ligand displacement assays were performed on The SK-N-MC/hH4R cell homogenates. Retained radioactivity was determined by liquid scintillation countin...
J Pharmacol Exp Ther 314: 1310-21 (2005)
Article DOI: 10.1124/jpet.105.087965
BindingDB Entry DOI: 10.7270/Q2KD1W6V
Histamine receptor (H3 and H4)
(Homo sapiens (Human))
BDBM22862
(2-(2-methyl-1H-imidazol-4-yl)ethan-1-amine | 2-Met...)
Show SMILES Cc1ncc(CCN)[nH]1
Show InChI InChI=1S/C6H11N3/c1-5-8-4-6(9-5)2-3-7/h4H,2-3,7H2,1H3,(H,8,9)
Reactome pathway
794n/an/an/an/an/an/an/an/a
University of Regensburg
Curated by ChEMBL
Assay Description
Displacement of [3H]-histamine from human histamine H4 receptor expressed in Sf9 cells coexpressing RGS19, Galphai2, Gbeta1gamma2
Bioorg Med Chem Lett 20: 7191-9 (2010)
Article DOI: 10.1016/j.bmcl.2010.10.041
BindingDB Entry DOI: 10.7270/Q2Q81GX5
Histamine H1 receptor
(Homo sapiens (Human))
BDBM22862
(2-(2-methyl-1H-imidazol-4-yl)ethan-1-amine | 2-Met...)
Show SMILES Cc1ncc(CCN)[nH]1
Show InChI InChI=1S/C6H11N3/c1-5-8-4-6(9-5)2-3-7/h4H,2-3,7H2,1H3,(H,8,9)
Reactome pathway
n/an/an/an/a 794n/an/an/an/a
University of Regensburg
Curated by ChEMBL
Assay Description
Agonist activity at human recombinant histamine H1 receptor expressed in Sf9 cells coexpressing RGS4 by steady-state GTPase activity assay
Bioorg Med Chem Lett 20: 7191-9 (2010)
Article DOI: 10.1016/j.bmcl.2010.10.041
BindingDB Entry DOI: 10.7270/Q2Q81GX5
Histamine receptor (H3 and H4)
(Homo sapiens (Human))
BDBM22862
(2-(2-methyl-1H-imidazol-4-yl)ethan-1-amine | 2-Met...)
Show SMILES Cc1ncc(CCN)[nH]1
Show InChI InChI=1S/C6H11N3/c1-5-8-4-6(9-5)2-3-7/h4H,2-3,7H2,1H3,(H,8,9)
Reactome pathway
n/an/an/an/a 3.98E+3n/an/an/an/a
University of Regensburg
Curated by ChEMBL
Assay Description
Agonist activity at human recombinant histamine H4 receptor expressed in Sf9 cells coexpressing RGS19, Galphai2, Gbeta1gamma2 by steady-state GTPase ...
Bioorg Med Chem Lett 20: 7191-9 (2010)
Article DOI: 10.1016/j.bmcl.2010.10.041
BindingDB Entry DOI: 10.7270/Q2Q81GX5