BDBM228869 US9556135, 120
SMILES: C[C@]1(CS(=O)(=O)C2(CC(F)(F)C2)C(N)=N1)c1cc(NC(=O)c2ccc(Cl)cn2)ccc1F
InChI Key: InChIKey=NEKASRYLAHQPAG-SFHVURJKSA-N
Data: 2 IC50
Activity Spreadsheet -- Enzyme Inhibition Constant Data from BindingDB
Found 2 hits for monomerid = 228869
Trg + Lig
Ki
nM
ΔG°
kcal/mole
IC50
nM
Kd
nM
EC50/IC50
nM
koff
s-1
kon
M-1s-1
pHTemp
°C
Cathepsin D
(Homo sapiens (Human))
BDBM228869
(US9556135, 120)
Show SMILES C[C@]1(CS(=O)(=O)C2(CC(F)(F)C2)C(N)=N1)c1cc(NC(=O)c2ccc(Cl)cn2)ccc1F |r,c:14|
Show InChI InChI=1S/C20H18ClF3N4O3S/c1-18(10-32(30,31)19(17(25)28-18)8-20(23,24)9-19)13-6-12(3-4-14(13)22)27-16(29)15-5-2-11(21)7-26-15/h2-7H,8-10H2,1H3,(H2,25,28)(H,27,29)/t18-/m0/s1
NCI pathway
Reactome pathway
US Patent
n/an/a 1.48E+5n/an/an/an/a3.5n/a
Amgen, Inc.
US Patent
Assay Description
Recombinant Cat D was expressed in CHO cells. The assay buffer for CathepsinD is 0.05 M citrate pH 3.5, 10% DMSO final, 5 mM CHAPS. The Cat D enzyme ...
US Patent US9556135 (2017)
BindingDB Entry DOI: 10.7270/Q2X0691F
Beta-secretase 1
(Homo sapiens (Human))
BDBM228869
(US9556135, 120)
Show SMILES C[C@]1(CS(=O)(=O)C2(CC(F)(F)C2)C(N)=N1)c1cc(NC(=O)c2ccc(Cl)cn2)ccc1F |r,c:14|
Show InChI InChI=1S/C20H18ClF3N4O3S/c1-18(10-32(30,31)19(17(25)28-18)8-20(23,24)9-19)13-6-12(3-4-14(13)22)27-16(29)15-5-2-11(21)7-26-15/h2-7H,8-10H2,1H3,(H2,25,28)(H,27,29)/t18-/m0/s1
US Patent
n/an/a 1.30n/an/an/an/an/an/a
Amgen, Inc.
US Patent
Assay Description
Several animal models, including mouse, rat, dog, and monkey, may be used to screen for inhibition of beta-secretase activity in vivo following admin...
US Patent US9556135 (2017)
BindingDB Entry DOI: 10.7270/Q2X0691F