BDBM229973 US9334286, 1
SMILES: COc1cc(ccc1Nc1cc2cc(ccc2cn1)-c1cnn(CC2CCOCC2)c1)-c1cnc(C)n1C
InChI Key: InChIKey=AVHMUDRGCOLVGH-UHFFFAOYSA-N
Data: 1 IC50
Activity Spreadsheet -- Enzyme Inhibition Constant Data from BindingDB
Found 1 hit for monomerid = 229973
Trg + Lig
Ki
nM
ΔG°
kcal/mole
IC50
nM
Kd
nM
EC50/IC50
nM
koff
s-1
kon
M-1s-1
pHTemp
°C
Dual specificity protein kinase TTK
(Homo sapiens (Human))
BDBM229973
(US9334286, 1)
Show SMILES COc1cc(ccc1Nc1cc2cc(ccc2cn1)-c1cnn(CC2CCOCC2)c1)-c1cnc(C)n1C
Show InChI InChI=1S/C30H32N6O2/c1-20-31-17-28(35(20)2)23-6-7-27(29(13-23)37-3)34-30-14-25-12-22(4-5-24(25)15-32-30)26-16-33-36(19-26)18-21-8-10-38-11-9-21/h4-7,12-17,19,21H,8-11,18H2,1-3H3,(H,32,34)
US Patent
n/an/a 2n/an/an/an/a7.025
Cancer Research Technology Limited
US Patent
Assay Description
The enzyme reaction (total volume 10 μl) was carried out in black 384-well low volume plates containing full length MPS1 (12.5 nM or 3 nM), fluo...
US Patent US9334286 (2016)
BindingDB Entry DOI: 10.7270/Q2GB22X3