null
SMILES: COCCNC(=O)c1ccc(Nc2cc3cc(ccc3cn2)-c2cnn(CC(C)(C)O)c2)c(OC)c1
InChI Key: InChIKey=XRJAIBLGIJGYBP-UHFFFAOYSA-N
Activity Spreadsheet -- Enzyme Inhibition Constant Data from BindingDB
Found 2 hits for monomerid = 230936
Trg + Lig
Ki
nM
ΔG°
kcal/mole
IC50
nM
Kd
nM
EC50/IC50
nM
koff
s-1
kon
M-1s-1
pHTemp
°C
Dual specificity protein kinase TTK
(Homo sapiens (Human))
BDBM230936
(US10188642, Example 62 | US9334286, 62)
Show SMILES COCCNC(=O)c1ccc(Nc2cc3cc(ccc3cn2)-c2cnn(CC(C)(C)O)c2)c(OC)c1
Show InChI InChI=1S/C27H31N5O4/c1-27(2,34)17-32-16-22(15-30-32)18-5-6-20-14-29-25(13-21(20)11-18)31-23-8-7-19(12-24(23)36-4)26(33)28-9-10-35-3/h5-8,11-16,34H,9-10,17H2,1-4H3,(H,28,33)(H,29,31)
US Patent
n/an/a 3n/an/an/an/an/an/a
Cancer Research Technology Limited
US Patent
Assay Description
The enzyme reaction (total volume 10 μl) was carried out in black 384-well low volume plates containing full length MPS1 (12.5 nM or 3 nM), fluo...
US Patent US10188642 (2019)
BindingDB Entry DOI: 10.7270/Q2D50Q2N
Dual specificity protein kinase TTK
(Homo sapiens (Human))
BDBM230936
(US10188642, Example 62 | US9334286, 62)
Show SMILES COCCNC(=O)c1ccc(Nc2cc3cc(ccc3cn2)-c2cnn(CC(C)(C)O)c2)c(OC)c1
Show InChI InChI=1S/C27H31N5O4/c1-27(2,34)17-32-16-22(15-30-32)18-5-6-20-14-29-25(13-21(20)11-18)31-23-8-7-19(12-24(23)36-4)26(33)28-9-10-35-3/h5-8,11-16,34H,9-10,17H2,1-4H3,(H,28,33)(H,29,31)
US Patent
n/an/a 3n/an/an/an/a7.025
Cancer Research Technology Limited
US Patent
Assay Description
The enzyme reaction (total volume 10 μl) was carried out in black 384-well low volume plates containing full length MPS1 (12.5 nM or 3 nM), fluo...
US Patent US9334286 (2016)
BindingDB Entry DOI: 10.7270/Q2GB22X3