BDBM234366 2-Allyl-1-cyclohexyloxy-4-methoxybenzene (4j)
SMILES: COc1ccc(OC2CCCCC2)c(CC=C)c1
InChI Key: InChIKey=OOGTZKWNJCAFAC-UHFFFAOYSA-N
Data: 1 KI  1 IC50
Activity Spreadsheet -- Enzyme Inhibition Constant Data from BindingDB
Found 1 hit for monomerid = 234366
Trg + Lig
Ki
nM
ΔG°
kcal/mole
IC50
nM
Kd
nM
EC50/IC50
nM
koff
s-1
kon
M-1s-1
pHTemp
°C
15-Lipoxygenase (SLO)
(Glycine max (Soybean))
BDBM234366
(2-Allyl-1-cyclohexyloxy-4-methoxybenzene (4j))
Show SMILES COc1ccc(OC2CCCCC2)c(CC=C)c1
Show InChI InChI=1S/C16H22O2/c1-3-7-13-12-15(17-2)10-11-16(13)18-14-8-5-4-6-9-14/h3,10-12,14H,1,4-9H2,2H3
1.38E+4 -6.09 4.41E+4n/an/an/an/a9.01
Mashhad University of Medical Sciences
Assay Description
Lipoxygenase activity was measured in borate buffer solutions (0.1 M, pH 9) using the method described in the literature [Malterud et al., J. Agric. ...
J Enzyme Inhib Med Chem 26: 238-44 (2011)
Article DOI: 10.3109/14756366.2010.495717
BindingDB Entry DOI: 10.7270/Q25D8QQF