BDBM23607 3-Phenoxybenzoylamino deriv., 28a::3-[(3-phenoxybenzene)amido]thiophene-2-carboxylic acid
SMILES: OC(=O)c1sccc1NC(=O)c1cccc(Oc2ccccc2)c1
InChI Key: InChIKey=ZGJBKTLOTKCFTO-UHFFFAOYSA-N
Data: 1 IC50
Activity Spreadsheet -- Enzyme Inhibition Constant Data from BindingDB
Found 1 hit for monomerid = 23607
Trg + Lig
Ki
nM
ΔG°
kcal/mole
IC50
nM
Kd
nM
EC50/IC50
nM
koff
s-1
kon
M-1s-1
pHTemp
°C
3-oxoacyl-[acyl-carrier-protein] synthase 3
(Enterococcus faecalis)
BDBM23607
(3-Phenoxybenzoylamino deriv., 28a | 3-[(3-phenoxyb...)
Show SMILES OC(=O)c1sccc1NC(=O)c1cccc(Oc2ccccc2)c1
Show InChI InChI=1S/C18H13NO4S/c20-17(19-15-9-10-24-16(15)18(21)22)12-5-4-8-14(11-12)23-13-6-2-1-3-7-13/h1-11H,(H,19,20)(H,21,22)
n/an/a 1.01E+4n/an/an/an/an/an/a
Quorex Pharmaceuticals Inc.
Assay Description
The potency of FabH inhibition (IC50) was determined using [3H]- or [14C]-radiolabeled substrates. This was accomplished at fixed concentrations of a...
J Med Chem 48: 1596-609 (2005)
Article DOI: 10.1021/jm049141s
BindingDB Entry DOI: 10.7270/Q22B8W9H