null
SMILES: Cc1cc(ccc1C(=O)NC1CC1)-n1cnc2c(NCC3CCOCC3)cc(Oc3cccc(F)c3)cc12
InChI Key: InChIKey=OMVOMLCTSZATFB-UHFFFAOYSA-N
Activity Spreadsheet -- Enzyme Inhibition Constant Data from BindingDB
Found 1 hit for monomerid = 236668
Trg + Lig
Ki
nM
ΔG°
kcal/mole
IC50
nM
Kd
nM
EC50/IC50
nM
koff
s-1
kon
M-1s-1
pHTemp
°C
Dual specificity protein kinase TTK
(Homo sapiens (Human))
BDBM236668
(US9388140, 9)
Show SMILES Cc1cc(ccc1C(=O)NC1CC1)-n1cnc2c(NCC3CCOCC3)cc(Oc3cccc(F)c3)cc12
Show InChI InChI=1S/C30H31FN4O3/c1-19-13-23(7-8-26(19)30(36)34-22-5-6-22)35-18-33-29-27(32-17-20-9-11-37-12-10-20)15-25(16-28(29)35)38-24-4-2-3-21(31)14-24/h2-4,7-8,13-16,18,20,22,32H,5-6,9-12,17H2,1H3,(H,34,36)
US Patent
n/an/a 0.400n/an/an/an/a7.722
Bayer Intellectual Property GmbH
US Patent
Assay Description
For the assay 50 nL of a 100-fold concentrated solution of the test compound in DMSO was pipetted into a black low volume 384 well microtiter plate (...
US Patent US9388140 (2016)
BindingDB Entry DOI: 10.7270/Q2BP01QF