BDBM236673 BDBM236695::US9388140, 14
SMILES: Cc1cc(ccc1C(=O)NC1CC1)-n1cnc2c(NCCC(F)(F)F)cc(Oc3cccc(F)c3F)cc12
InChI Key: InChIKey=WAOOIWBDDXUZAN-UHFFFAOYSA-N
Data: 2 IC50
Activity Spreadsheet -- Enzyme Inhibition Constant Data from BindingDB
Found 2 hits for monomerid = 236673
Trg + Lig
Ki
nM
ΔG°
kcal/mole
IC50
nM
Kd
nM
EC50/IC50
nM
koff
s-1
kon
M-1s-1
pHTemp
°C
Dual specificity protein kinase TTK
(Homo sapiens (Human))
BDBM236673
(BDBM236695 | US9388140, 14)
Show SMILES Cc1cc(ccc1C(=O)NC1CC1)-n1cnc2c(NCCC(F)(F)F)cc(Oc3cccc(F)c3F)cc12
Show InChI InChI=1S/C27H23F5N4O2/c1-15-11-17(7-8-19(15)26(37)35-16-5-6-16)36-14-34-25-21(33-10-9-27(30,31)32)12-18(13-22(25)36)38-23-4-2-3-20(28)24(23)29/h2-4,7-8,11-14,16,33H,5-6,9-10H2,1H3,(H,35,37)
US Patent
n/an/a 0.400n/an/an/an/a7.722
Bayer Intellectual Property GmbH
US Patent
Assay Description
For the assay 50 nL of a 100-fold concentrated solution of the test compound in DMSO was pipetted into a black low volume 384 well microtiter plate (...
US Patent US9388140 (2016)
BindingDB Entry DOI: 10.7270/Q2BP01QF
Dual specificity protein kinase TTK
(Homo sapiens (Human))
BDBM236673
(BDBM236695 | US9388140, 14)
Show SMILES Cc1cc(ccc1C(=O)NC1CC1)-n1cnc2c(NCCC(F)(F)F)cc(Oc3cccc(F)c3F)cc12
Show InChI InChI=1S/C27H23F5N4O2/c1-15-11-17(7-8-19(15)26(37)35-16-5-6-16)36-14-34-25-21(33-10-9-27(30,31)32)12-18(13-22(25)36)38-23-4-2-3-20(28)24(23)29/h2-4,7-8,11-14,16,33H,5-6,9-10H2,1H3,(H,35,37)
US Patent
n/an/a 0.5n/an/an/an/a7.722
Bayer Intellectual Property GmbH
US Patent
Assay Description
For the assay 50 nL of a 100-fold concentrated solution of the test compound in DMSO was pipetted into a black low volume 384 well microtiter plate (...
US Patent US9388140 (2016)
BindingDB Entry DOI: 10.7270/Q2BP01QF