null
SMILES: CC(=O)CCSC(c1ccccc1)(c1ccccc1)c1ccccc1
InChI Key: InChIKey=NJPYMWZOTVJRPI-UHFFFAOYSA-N
Activity Spreadsheet -- Enzyme Inhibition Constant Data from BindingDB
Found 1 hit for monomerid = 23796
Trg + Lig
Ki
nM
ΔG°
kcal/mole
IC50
nM
Kd
nM
EC50/IC50
nM
koff
s-1
kon
M-1s-1
pHTemp
°C
Kinesin-like protein KIF11
(Homo sapiens (Human))
BDBM23796
(4-[(triphenylmethyl)sulfanyl]butan-2-one | Triphen...)
Show SMILES CC(=O)CCSC(c1ccccc1)(c1ccccc1)c1ccccc1
Show InChI InChI=1S/C23H22OS/c1-19(24)17-18-25-23(20-11-5-2-6-12-20,21-13-7-3-8-14-21)22-15-9-4-10-16-22/h2-16H,17-18H2,1H3
Reactome pathway
n/an/an/an/an/an/an/a6.922
Institut de Biologie Structurale
Assay Description
The microtubule-activated ATPase rates were measured using the pyruvate kinase/lactate dehydrogenase-linked assay. To optimize the signal for basal E...
J Med Chem 51: 1115-25 (2008)
Article DOI: 10.1021/jm070606z
BindingDB Entry DOI: 10.7270/Q2DJ5CXD