BDBM241211 US9409907, 53
SMILES: COc1cc(ccc1Nc1ncc2ccnc(OCC3CC3)c2n1)-c1cnn(C)c1
InChI Key: InChIKey=BWHUMVAWMHVYPY-UHFFFAOYSA-N
Data: 2 IC50
Activity Spreadsheet -- Enzyme Inhibition Constant Data from BindingDB
Found 3 hits for monomerid = 241211
Trg + Lig
Ki
nM
ΔG°
kcal/mole
IC50
nM
Kd
nM
EC50/IC50
nM
koff
s-1
kon
M-1s-1
pHTemp
°C
Dual specificity protein kinase TTK
(Homo sapiens (Human))
BDBM241211
(US11046688, Example 53 | US9409907, 53)
Show SMILES COc1cc(ccc1Nc1ncc2ccnc(OCC3CC3)c2n1)-c1cnn(C)c1
Show InChI InChI=1S/C22H22N6O2/c1-28-12-17(11-25-28)15-5-6-18(19(9-15)29-2)26-22-24-10-16-7-8-23-21(20(16)27-22)30-13-14-3-4-14/h5-12,14H,3-4,13H2,1-2H3,(H,24,26,27)
US Patent
n/an/a 98n/an/an/an/a7.025
Cancer Research Technology Limited
US Patent
Assay Description
The enzyme reaction (total volume 10 μl) was carried out in black 384-well low volume plates containing full length MPS1 (12.5 nM or 3 nM), fluo...
US Patent US9409907 (2016)
BindingDB Entry DOI: 10.7270/Q2C24VB2
Dual specificity protein kinase TTK
(Homo sapiens (Human))
BDBM241211
(US11046688, Example 53 | US9409907, 53)
Show SMILES COc1cc(ccc1Nc1ncc2ccnc(OCC3CC3)c2n1)-c1cnn(C)c1
Show InChI InChI=1S/C22H22N6O2/c1-28-12-17(11-25-28)15-5-6-18(19(9-15)29-2)26-22-24-10-16-7-8-23-21(20(16)27-22)30-13-14-3-4-14/h5-12,14H,3-4,13H2,1-2H3,(H,24,26,27)
n/an/a 98n/an/an/an/an/an/a
TBA
Citation and Details
Dual specificity protein kinase TTK
(Homo sapiens (Human))
BDBM241211
(US11046688, Example 53 | US9409907, 53)
Show SMILES COc1cc(ccc1Nc1ncc2ccnc(OCC3CC3)c2n1)-c1cnn(C)c1
Show InChI InChI=1S/C22H22N6O2/c1-28-12-17(11-25-28)15-5-6-18(19(9-15)29-2)26-22-24-10-16-7-8-23-21(20(16)27-22)30-13-14-3-4-14/h5-12,14H,3-4,13H2,1-2H3,(H,24,26,27)
n/an/a 150n/an/an/an/an/an/a
The Institute of Cancer Research
Curated by ChEMBL
Assay Description
Inhibition of human full length MPS1 expressed in recombinant baculovirus infected Sf9 insect cells using 5FAM-DHTGFLTEYVATRCONH2 as substrate after ...
J Med Chem 59: 3671-88 (2016)
BindingDB Entry DOI: 10.7270/Q2DZ0B6T