BDBM24263 4-amino-N-[4-(benzyloxy)phenyl]butanamide::Modified amino acid analog, 7a
SMILES: NCCCC(=O)Nc1ccc(OCc2ccccc2)cc1
InChI Key: InChIKey=QTWBKNVNGVYTNZ-UHFFFAOYSA-N
Data: 1 IC50
PDB links: 1 PDB ID matches this monomer. 1 PDB ID contains this monomer as substructures. 1 PDB ID contains inhibitors having a similarity of 90% to this monomer.
Activity Spreadsheet -- Enzyme Inhibition Constant Data from BindingDB
Found 1 hit for monomerid = 24263
Trg + Lig
Ki
nM
ΔG°
kcal/mole
IC50
nM
Kd
nM
EC50/IC50
nM
koff
s-1
kon
M-1s-1
pHTemp
°C
Leukotriene A4 hydrolase
(Homo sapiens (Human))
BDBM24263
(4-amino-N-[4-(benzyloxy)phenyl]butanamide | Modifi...)
Show SMILES NCCCC(=O)Nc1ccc(OCc2ccccc2)cc1
Show InChI InChI=1S/C17H20N2O2/c18-12-4-7-17(20)19-15-8-10-16(11-9-15)21-13-14-5-2-1-3-6-14/h1-3,5-6,8-11H,4,7,12-13,18H2,(H,19,20)
Reactome pathway
n/an/a 61n/an/an/an/a7.522
Berlex Biosciences
Assay Description
Compound potency against the peptidase activity of LTA4 hydrolase was measured by inhibition of the hydrolysis of L-alanine-p-nitroanilide to L-alani...
Bioorg Med Chem 16: 4963-83 (2008)
Article DOI: 10.1016/j.bmc.2008.03.042
BindingDB Entry DOI: 10.7270/Q2BP013C
3D
3D Structure (crystal)