null
SMILES: CC(C)(C)NC(=O)C1CCN(Cc2cccc(NC(=O)C3C(C)(C)C3(C)C)c2)CC1
InChI Key: InChIKey=OZPHSJTZAPUYAN-UHFFFAOYSA-N
Activity Spreadsheet -- Enzyme Inhibition Constant Data from BindingDB
Found 1 hit for monomerid = 243921
Trg + Lig
Ki
nM
ΔG°
kcal/mole
IC50
nM
Kd
nM
EC50/IC50
nM
koff
s-1
kon
M-1s-1
pHTemp
°C
Atypical chemokine receptor 3
(Homo sapiens (Human))
BDBM243921
(US9428456, 1.260)
Show SMILES CC(C)(C)NC(=O)C1CCN(Cc2cccc(NC(=O)C3C(C)(C)C3(C)C)c2)CC1
Show InChI InChI=1S/C25H39N3O2/c1-23(2,3)27-21(29)18-11-13-28(14-12-18)16-17-9-8-10-19(15-17)26-22(30)20-24(4,5)25(20,6)7/h8-10,15,18,20H,11-14,16H2,1-7H3,(H,26,30)(H,27,29)
US Patent
n/an/an/an/a 0.900n/an/an/a37
ACTELION PHARMACEUTICALS LTD
US Patent
Assay Description
CHO-K1 CXCR7 b-arrestin cells are detached from culture dishes with a cell dissociation buffer (Invitrogen, #13151-014) and collected in growing medi...
US Patent US9428456 (2016)
BindingDB Entry DOI: 10.7270/Q29022PZ