BDBM247590 US10112931, Example 179::US9434719, 179::US9688672, Example 179
SMILES: C[C@@H](O)[C@H]1COC(=O)N1c1nc(NC(C)c2nc(no2)-c2ccc(Cl)c(OC(F)(F)F)c2)ncc1F
InChI Key: InChIKey=WXPAQCJZFINGNQ-VPQWPZGESA-N
Data: 8 IC50
Activity Spreadsheet -- Enzyme Inhibition Constant Data from BindingDB
Found 8 hits for monomerid = 247590
Trg + Lig
Ki
nM
ΔG°
kcal/mole
IC50
nM
Kd
nM
EC50/IC50
nM
koff
s-1
kon
M-1s-1
pHTemp
°C
Isocitrate dehydrogenase [NADP] cytoplasmic
(Homo sapiens (Human))
BDBM247590
(US10112931, Example 179 | US9434719, 179 | US96886...)
Show SMILES C[C@@H](O)[C@H]1COC(=O)N1c1nc(NC(C)c2nc(no2)-c2ccc(Cl)c(OC(F)(F)F)c2)ncc1F |r,w:13.14|
Show InChI InChI=1S/C20H17ClF4N6O5/c1-8(17-28-15(30-36-17)10-3-4-11(21)14(5-10)35-20(23,24)25)27-18-26-6-12(22)16(29-18)31-13(9(2)32)7-34-19(31)33/h3-6,8-9,13,32H,7H2,1-2H3,(H,26,27,29)/t8?,9-,13-/m1/s1
US Patent
n/an/a 7n/an/an/an/a7.525
NOVARTIS AG
US Patent
Assay Description
The IDH1 (R132H) mutant catalyzes the reduced form of NADP+ (NADPH) and α-ketoglutarate (α-KG) to form nicotinamide adenine dinucleotide ph...
US Patent US9434719 (2016)
BindingDB Entry DOI: 10.7270/Q2QV3KFR
Isocitrate dehydrogenase [NADP] cytoplasmic
(Homo sapiens (Human))
BDBM247590
(US10112931, Example 179 | US9434719, 179 | US96886...)
Show SMILES C[C@@H](O)[C@H]1COC(=O)N1c1nc(NC(C)c2nc(no2)-c2ccc(Cl)c(OC(F)(F)F)c2)ncc1F |r,w:13.14|
Show InChI InChI=1S/C20H17ClF4N6O5/c1-8(17-28-15(30-36-17)10-3-4-11(21)14(5-10)35-20(23,24)25)27-18-26-6-12(22)16(29-18)31-13(9(2)32)7-34-19(31)33/h3-6,8-9,13,32H,7H2,1-2H3,(H,26,27,29)/t8?,9-,13-/m1/s1
US Patent
n/an/a 5.5n/an/an/an/a7.425
NOVARTIS AG
US Patent
Assay Description
The biochemical reactions were performed at room temperature in 384-well Greiner flat-bottom plates (Costar, Cat. No. 781201) using a final reaction ...
US Patent US9434719 (2016)
BindingDB Entry DOI: 10.7270/Q2QV3KFR
Cytosolic NADP-isocitrate dehydrogenase (IDH1)(R132H)
(Homo sapiens (Human))
BDBM247590
(US10112931, Example 179 | US9434719, 179 | US96886...)
Show SMILES C[C@@H](O)[C@H]1COC(=O)N1c1nc(NC(C)c2nc(no2)-c2ccc(Cl)c(OC(F)(F)F)c2)ncc1F |r,w:13.14|
Show InChI InChI=1S/C20H17ClF4N6O5/c1-8(17-28-15(30-36-17)10-3-4-11(21)14(5-10)35-20(23,24)25)27-18-26-6-12(22)16(29-18)31-13(9(2)32)7-34-19(31)33/h3-6,8-9,13,32H,7H2,1-2H3,(H,26,27,29)/t8?,9-,13-/m1/s1
US Patent
n/an/a 364n/an/an/an/a7.525
NOVARTIS AG
US Patent
Assay Description
The IDH1 (R132H) mutant catalyzes the reduced form of NADP+(NADPH) and α-ketoglutarate (α-KG) to form nicotinamide adenine dinucleotide pho...
US Patent US9688672 (2017)
BindingDB Entry DOI: 10.7270/Q2251GBM
IDH1 R132H
(Homo sapiens (Human))
BDBM247590
(US10112931, Example 179 | US9434719, 179 | US96886...)
Show SMILES C[C@@H](O)[C@H]1COC(=O)N1c1nc(NC(C)c2nc(no2)-c2ccc(Cl)c(OC(F)(F)F)c2)ncc1F |r,w:13.14|
Show InChI InChI=1S/C20H17ClF4N6O5/c1-8(17-28-15(30-36-17)10-3-4-11(21)14(5-10)35-20(23,24)25)27-18-26-6-12(22)16(29-18)31-13(9(2)32)7-34-19(31)33/h3-6,8-9,13,32H,7H2,1-2H3,(H,26,27,29)/t8?,9-,13-/m1/s1
US Patent
n/an/a 5n/an/an/an/a7.425
NOVARTIS AG
US Patent
Assay Description
Mutant IDH1 R132H catalytic activity was monitored using the quantitative liquid chromatography/mass spectrometry (LC-MS) detection of 2-HG, a produc...
US Patent US10112931 (2018)
BindingDB Entry DOI: 10.7270/Q2PG1TRT
IDH1 R132H
(Homo sapiens (Human))
BDBM247590
(US10112931, Example 179 | US9434719, 179 | US96886...)
Show SMILES C[C@@H](O)[C@H]1COC(=O)N1c1nc(NC(C)c2nc(no2)-c2ccc(Cl)c(OC(F)(F)F)c2)ncc1F |r,w:13.14|
Show InChI InChI=1S/C20H17ClF4N6O5/c1-8(17-28-15(30-36-17)10-3-4-11(21)14(5-10)35-20(23,24)25)27-18-26-6-12(22)16(29-18)31-13(9(2)32)7-34-19(31)33/h3-6,8-9,13,32H,7H2,1-2H3,(H,26,27,29)/t8?,9-,13-/m1/s1
US Patent
n/an/a 364n/an/an/an/a7.525
NOVARTIS AG
US Patent
Assay Description
The IDH1 (R132H) mutant catalyzes the reduced form of NADP+ (NADPH) and α-ketoglutarate (α-KG) to form nicotinamide adenine dinucleotide ph...
US Patent US10112931 (2018)
BindingDB Entry DOI: 10.7270/Q2PG1TRT
IDH1 R132H
(Homo sapiens (Human))
BDBM247590
(US10112931, Example 179 | US9434719, 179 | US96886...)
Show SMILES C[C@@H](O)[C@H]1COC(=O)N1c1nc(NC(C)c2nc(no2)-c2ccc(Cl)c(OC(F)(F)F)c2)ncc1F |r,w:13.14|
Show InChI InChI=1S/C20H17ClF4N6O5/c1-8(17-28-15(30-36-17)10-3-4-11(21)14(5-10)35-20(23,24)25)27-18-26-6-12(22)16(29-18)31-13(9(2)32)7-34-19(31)33/h3-6,8-9,13,32H,7H2,1-2H3,(H,26,27,29)/t8?,9-,13-/m1/s1
US Patent
n/an/a 77n/an/an/an/a7.425
NOVARTIS AG
US Patent
Assay Description
Mutant IDH1 R132H catalytic activity was monitored using the quantitative liquid chromatography/mass spectrometry (LC-MS) detection of 2-HG, a produc...
US Patent US10112931 (2018)
BindingDB Entry DOI: 10.7270/Q2PG1TRT
IDH1 R132H
(Homo sapiens (Human))
BDBM247590
(US10112931, Example 179 | US9434719, 179 | US96886...)
Show SMILES C[C@@H](O)[C@H]1COC(=O)N1c1nc(NC(C)c2nc(no2)-c2ccc(Cl)c(OC(F)(F)F)c2)ncc1F |r,w:13.14|
Show InChI InChI=1S/C20H17ClF4N6O5/c1-8(17-28-15(30-36-17)10-3-4-11(21)14(5-10)35-20(23,24)25)27-18-26-6-12(22)16(29-18)31-13(9(2)32)7-34-19(31)33/h3-6,8-9,13,32H,7H2,1-2H3,(H,26,27,29)/t8?,9-,13-/m1/s1
US Patent
n/an/a 7n/an/an/an/a7.525
NOVARTIS AG
US Patent
Assay Description
The IDH1 (R132H) mutant catalyzes the reduced form of NADP+ (NADPH) and α-ketoglutarate (α-KG) to form nicotinamide adenine dinucleotide ph...
US Patent US10112931 (2018)
BindingDB Entry DOI: 10.7270/Q2PG1TRT
Cytosolic NADP-isocitrate dehydrogenase (IDH1)(R132H)
(Homo sapiens (Human))
BDBM247590
(US10112931, Example 179 | US9434719, 179 | US96886...)
Show SMILES C[C@@H](O)[C@H]1COC(=O)N1c1nc(NC(C)c2nc(no2)-c2ccc(Cl)c(OC(F)(F)F)c2)ncc1F |r,w:13.14|
Show InChI InChI=1S/C20H17ClF4N6O5/c1-8(17-28-15(30-36-17)10-3-4-11(21)14(5-10)35-20(23,24)25)27-18-26-6-12(22)16(29-18)31-13(9(2)32)7-34-19(31)33/h3-6,8-9,13,32H,7H2,1-2H3,(H,26,27,29)/t8?,9-,13-/m1/s1
US Patent
n/an/a 7n/an/an/an/a7.525
NOVARTIS AG
US Patent
Assay Description
The IDH1 (R132H) mutant catalyzes the reduced form of NADP+(NADPH) and α-ketoglutarate (α-KG) to form nicotinamide adenine dinucleotide pho...
US Patent US9688672 (2017)
BindingDB Entry DOI: 10.7270/Q2251GBM