BDBM255299 US9481682, 48
SMILES: C[C@@H]1OC(=O)N2C[C@@H](CC[C@@H]12)c1nc(-c2ccc(cc2)C(=O)Nc2cc(ccn2)C(F)(F)F)c2c(N)nccn12
InChI Key: InChIKey=VZACQBWWRMYDEL-YJLNNSPDSA-N
Data: 1 IC50
Activity Spreadsheet -- Enzyme Inhibition Constant Data from BindingDB
Found 4 hits for monomerid = 255299
Trg + Lig
Ki
nM
ΔG°
kcal/mole
IC50
nM
Kd
nM
EC50/IC50
nM
koff
s-1
kon
M-1s-1
pHTemp
°C
Tyrosine-protein kinase BTK
(Homo sapiens (Human))
BDBM255299
(US9481682, 48)
Show SMILES C[C@@H]1OC(=O)N2C[C@@H](CC[C@@H]12)c1nc(-c2ccc(cc2)C(=O)Nc2cc(ccn2)C(F)(F)F)c2c(N)nccn12 |r|
Show InChI InChI=1S/C27H24F3N7O3/c1-14-19-7-6-17(13-37(19)26(39)40-14)24-35-21(22-23(31)33-10-11-36(22)24)15-2-4-16(5-3-15)25(38)34-20-12-18(8-9-32-20)27(28,29)30/h2-5,8-12,14,17,19H,6-7,13H2,1H3,(H2,31,33)(H,32,34,38)/t14-,17+,19-/m0/s1
NCI pathway
Reactome pathway
US Patent
n/an/a 0.140n/an/an/an/an/an/a
MERCK SHARP & DOHME CORP.
US Patent
Assay Description
BTK enzymatic activity was determined with the LANCE (Lanthanide Chelate Excite) TR-FRET (Time-resolved fluorescence resonance energy transfer) assay...
US Patent US9481682 (2016)
BindingDB Entry DOI: 10.7270/Q2959GGM
Tyrosine-protein kinase BTK
(Homo sapiens (Human))
BDBM255299
(US9481682, 48)
Show SMILES C[C@@H]1OC(=O)N2C[C@@H](CC[C@@H]12)c1nc(-c2ccc(cc2)C(=O)Nc2cc(ccn2)C(F)(F)F)c2c(N)nccn12 |r|
Show InChI InChI=1S/C27H24F3N7O3/c1-14-19-7-6-17(13-37(19)26(39)40-14)24-35-21(22-23(31)33-10-11-36(22)24)15-2-4-16(5-3-15)25(38)34-20-12-18(8-9-32-20)27(28,29)30/h2-5,8-12,14,17,19H,6-7,13H2,1H3,(H2,31,33)(H,32,34,38)/t14-,17+,19-/m0/s1
NCI pathway
Reactome pathway
n/an/a 86n/an/an/an/an/an/a
TBA
Citation and Details
Tyrosine-protein kinase BTK
(Homo sapiens (Human))
BDBM255299
(US9481682, 48)
Show SMILES C[C@@H]1OC(=O)N2C[C@@H](CC[C@@H]12)c1nc(-c2ccc(cc2)C(=O)Nc2cc(ccn2)C(F)(F)F)c2c(N)nccn12 |r|
Show InChI InChI=1S/C27H24F3N7O3/c1-14-19-7-6-17(13-37(19)26(39)40-14)24-35-21(22-23(31)33-10-11-36(22)24)15-2-4-16(5-3-15)25(38)34-20-12-18(8-9-32-20)27(28,29)30/h2-5,8-12,14,17,19H,6-7,13H2,1H3,(H2,31,33)(H,32,34,38)/t14-,17+,19-/m0/s1
NCI pathway
Reactome pathway
n/an/a 4.90n/an/an/an/an/an/a
TBA
Citation and Details
Tyrosine-protein kinase BTK
(Homo sapiens (Human))
BDBM255299
(US9481682, 48)
Show SMILES C[C@@H]1OC(=O)N2C[C@@H](CC[C@@H]12)c1nc(-c2ccc(cc2)C(=O)Nc2cc(ccn2)C(F)(F)F)c2c(N)nccn12 |r|
Show InChI InChI=1S/C27H24F3N7O3/c1-14-19-7-6-17(13-37(19)26(39)40-14)24-35-21(22-23(31)33-10-11-36(22)24)15-2-4-16(5-3-15)25(38)34-20-12-18(8-9-32-20)27(28,29)30/h2-5,8-12,14,17,19H,6-7,13H2,1H3,(H2,31,33)(H,32,34,38)/t14-,17+,19-/m0/s1
NCI pathway
Reactome pathway
n/an/a 0.130n/an/an/an/an/an/a
TBA
Citation and Details