BDBM255803 5-{3-[1-(4-Amino-3-methyl-1H-pyrazolo[3,4-d]pyrimidin-1-yl)ethyl]-5-chloro-2-ethoxy-6-methylphenyl}-N,N-dimethylpyridine-2-carboxamide bis(trifluoroacetate)::US10092570, Example 14::US10376513, Example 195::US10646492, Example 195::US9707233, 14::US9707233, 195::US9730939, Example 195::US9932341, Example 195
SMILES: CCOc1c(cc(Cl)c(C)c1-c1ccc(nc1)C(=O)N(C)C)C(C)n1nc(C)c2c(N)ncnc12
InChI Key: InChIKey=RYYHOGBWUDOVBW-UHFFFAOYSA-N
Data: 12 IC50
Activity Spreadsheet -- Enzyme Inhibition Constant Data from BindingDB
Found 12 hits for monomerid = 255803
Trg + Lig
Ki
nM
ΔG°
kcal/mole
IC50
nM
Kd
nM
EC50/IC50
nM
koff
s-1
kon
M-1s-1
pHTemp
°C
p110delta/p85alpha
(Homo sapiens (Human))
BDBM255803
(5-{3-[1-(4-Amino-3-methyl-1H-pyrazolo[3,4-d]pyrimi...)
Show SMILES CCOc1c(cc(Cl)c(C)c1-c1ccc(nc1)C(=O)N(C)C)C(C)n1nc(C)c2c(N)ncnc12
Show InChI InChI=1S/C25H28ClN7O2/c1-7-35-22-17(15(4)33-24-21(14(3)31-33)23(27)29-12-30-24)10-18(26)13(2)20(22)16-8-9-19(28-11-16)25(34)32(5)6/h8-12,15H,7H2,1-6H3,(H2,27,29,30)
US Patent
n/an/a<10n/an/an/an/a6.725
Incyte Holdings Corporation; Incyte Corporation
US Patent
Assay Description
Lipid kinase substrate, phosphoinositol-4,5-bisphosphate (PIP2), are purchased from Echelon Biosciences (Salt Lake City, Utah). PI3K isoforms α,...
US Patent US9707233 (2017)
BindingDB Entry DOI: 10.7270/Q2S46V0R
p110delta/p85alpha
(Homo sapiens (Human))
BDBM255803
(5-{3-[1-(4-Amino-3-methyl-1H-pyrazolo[3,4-d]pyrimi...)
Show SMILES CCOc1c(cc(Cl)c(C)c1-c1ccc(nc1)C(=O)N(C)C)C(C)n1nc(C)c2c(N)ncnc12
Show InChI InChI=1S/C25H28ClN7O2/c1-7-35-22-17(15(4)33-24-21(14(3)31-33)23(27)29-12-30-24)10-18(26)13(2)20(22)16-8-9-19(28-11-16)25(34)32(5)6/h8-12,15H,7H2,1-6H3,(H2,27,29,30)
US Patent
n/an/a<10n/an/an/an/a6.725
Incyte Holdings Corporation; Incyte Corporation
US Patent
Assay Description
Lipid kinase substrate, phosphoinositol-4,5-bisphosphate (PIP2), are purchased from Echelon Biosciences (Salt Lake City, Utah). PI3K isoforms α,...
US Patent US9707233 (2017)
BindingDB Entry DOI: 10.7270/Q2S46V0R
Phosphatidylinositol 4,5-bisphosphate 3-kinase catalytic subunit delta isoform
(Homo sapiens (Human))
BDBM255803
(5-{3-[1-(4-Amino-3-methyl-1H-pyrazolo[3,4-d]pyrimi...)
Show SMILES CCOc1c(cc(Cl)c(C)c1-c1ccc(nc1)C(=O)N(C)C)C(C)n1nc(C)c2c(N)ncnc12
Show InChI InChI=1S/C25H28ClN7O2/c1-7-35-22-17(15(4)33-24-21(14(3)31-33)23(27)29-12-30-24)10-18(26)13(2)20(22)16-8-9-19(28-11-16)25(34)32(5)6/h8-12,15H,7H2,1-6H3,(H2,27,29,30)
NCI pathway
Reactome pathway
US Patent
n/an/a<10n/an/an/an/a6.725
Incyte Holdings Corporation; Incyte Corporation
US Patent
Assay Description
[γ-33P]ATP (10 mCi/mL) was purchased from Perkin-Elmer (Waltham, Mass.). Lipid kinase substrate, D-myo-Phosphatidylinositol 4,5-bisphosphate (Pt...
US Patent US10092570 (2018)
BindingDB Entry DOI: 10.7270/Q2PZ5BW5
Phosphatidylinositol 4,5-bisphosphate 3-kinase catalytic subunit delta isoform
(Homo sapiens (Human))
BDBM255803
(5-{3-[1-(4-Amino-3-methyl-1H-pyrazolo[3,4-d]pyrimi...)
Show SMILES CCOc1c(cc(Cl)c(C)c1-c1ccc(nc1)C(=O)N(C)C)C(C)n1nc(C)c2c(N)ncnc12
Show InChI InChI=1S/C25H28ClN7O2/c1-7-35-22-17(15(4)33-24-21(14(3)31-33)23(27)29-12-30-24)10-18(26)13(2)20(22)16-8-9-19(28-11-16)25(34)32(5)6/h8-12,15H,7H2,1-6H3,(H2,27,29,30)
NCI pathway
Reactome pathway
US Patent
n/an/a<10n/an/an/an/a6.725
Incyte Holdings Corporation; Incyte Corporation
US Patent
Assay Description
[γ-33P]ATP (10 mCi/mL) was purchased from Perkin-Elmer (Waltham, Mass.). Lipid kinase substrate, D-myo-Phosphatidylinositol 4,5-bisphosphate (Pt...
US Patent US10092570 (2018)
BindingDB Entry DOI: 10.7270/Q2PZ5BW5
Phosphatidylinositol 4,5-bisphosphate 3-kinase catalytic subunit delta isoform
(Homo sapiens (Human))
BDBM255803
(5-{3-[1-(4-Amino-3-methyl-1H-pyrazolo[3,4-d]pyrimi...)
Show SMILES CCOc1c(cc(Cl)c(C)c1-c1ccc(nc1)C(=O)N(C)C)C(C)n1nc(C)c2c(N)ncnc12
Show InChI InChI=1S/C25H28ClN7O2/c1-7-35-22-17(15(4)33-24-21(14(3)31-33)23(27)29-12-30-24)10-18(26)13(2)20(22)16-8-9-19(28-11-16)25(34)32(5)6/h8-12,15H,7H2,1-6H3,(H2,27,29,30)
NCI pathway
Reactome pathway
US Patent
n/an/a<10n/an/an/an/an/an/a
Incyte Holdings Corporation; Incyte Corporation
US Patent
Assay Description
[γ-33P]ATP (10 mCi/mL) was purchased from PerkinElmer (Waltham, Mass.). Lipid kinase substrate, D-myo-Phosphatidylinositol 4,5-bisphosphate (Ptd...
US Patent US9730939 (2017)
BindingDB Entry DOI: 10.7270/Q2GB265W
Phosphatidylinositol 4,5-bisphosphate 3-kinase catalytic subunit delta isoform
(Homo sapiens (Human))
BDBM255803
(5-{3-[1-(4-Amino-3-methyl-1H-pyrazolo[3,4-d]pyrimi...)
Show SMILES CCOc1c(cc(Cl)c(C)c1-c1ccc(nc1)C(=O)N(C)C)C(C)n1nc(C)c2c(N)ncnc12
Show InChI InChI=1S/C25H28ClN7O2/c1-7-35-22-17(15(4)33-24-21(14(3)31-33)23(27)29-12-30-24)10-18(26)13(2)20(22)16-8-9-19(28-11-16)25(34)32(5)6/h8-12,15H,7H2,1-6H3,(H2,27,29,30)
NCI pathway
Reactome pathway
US Patent
n/an/a<10n/an/an/an/an/an/a
Incyte Corporation; Incyte Holdings Corporation
US Patent
Assay Description
The kinase reaction was conducted in polystyrene 384-well matrix white plate from Thermo Fisher Scientific in a final volume of 25 uL. Inhibitors wer...
US Patent US10646492 (2020)
Phosphatidylinositol 4,5-bisphosphate 3-kinase catalytic subunit delta isoform
(Homo sapiens (Human))
BDBM255803
(5-{3-[1-(4-Amino-3-methyl-1H-pyrazolo[3,4-d]pyrimi...)
Show SMILES CCOc1c(cc(Cl)c(C)c1-c1ccc(nc1)C(=O)N(C)C)C(C)n1nc(C)c2c(N)ncnc12
Show InChI InChI=1S/C25H28ClN7O2/c1-7-35-22-17(15(4)33-24-21(14(3)31-33)23(27)29-12-30-24)10-18(26)13(2)20(22)16-8-9-19(28-11-16)25(34)32(5)6/h8-12,15H,7H2,1-6H3,(H2,27,29,30)
NCI pathway
Reactome pathway
US Patent
n/an/a<10n/an/an/an/an/an/a
Istanbul University
Assay Description
The kinase reaction was conducted in polystyrene 384-well matrix white plate from Thermo Fisher Scientific in a final volume of 25 uL. Inhibitors wer...
Bioorg Med Chem 16: 9113-20 (2008)
BindingDB Entry DOI: 10.7270/Q2SJ1NZ2
Phosphatidylinositol 4,5-bisphosphate 3-kinase catalytic subunit delta isoform
(Homo sapiens (Human))
BDBM255803
(5-{3-[1-(4-Amino-3-methyl-1H-pyrazolo[3,4-d]pyrimi...)
Show SMILES CCOc1c(cc(Cl)c(C)c1-c1ccc(nc1)C(=O)N(C)C)C(C)n1nc(C)c2c(N)ncnc12
Show InChI InChI=1S/C25H28ClN7O2/c1-7-35-22-17(15(4)33-24-21(14(3)31-33)23(27)29-12-30-24)10-18(26)13(2)20(22)16-8-9-19(28-11-16)25(34)32(5)6/h8-12,15H,7H2,1-6H3,(H2,27,29,30)
NCI pathway
Reactome pathway
US Patent
n/an/a<10n/an/an/an/an/an/a
Istanbul University
Assay Description
The kinase reaction was conducted in polystyrene 384-well matrix white plate from Thermo Fisher Scientific in a final volume of 25 uL. Inhibitors wer...
Bioorg Med Chem 16: 9113-20 (2008)
BindingDB Entry DOI: 10.7270/Q2SJ1NZ2
Phosphatidylinositol 4,5-bisphosphate 3-kinase catalytic subunit delta isoform
(Homo sapiens (Human))
BDBM255803
(5-{3-[1-(4-Amino-3-methyl-1H-pyrazolo[3,4-d]pyrimi...)
Show SMILES CCOc1c(cc(Cl)c(C)c1-c1ccc(nc1)C(=O)N(C)C)C(C)n1nc(C)c2c(N)ncnc12
Show InChI InChI=1S/C25H28ClN7O2/c1-7-35-22-17(15(4)33-24-21(14(3)31-33)23(27)29-12-30-24)10-18(26)13(2)20(22)16-8-9-19(28-11-16)25(34)32(5)6/h8-12,15H,7H2,1-6H3,(H2,27,29,30)
NCI pathway
Reactome pathway
US Patent
n/an/a<10n/an/an/an/an/an/a
Incyte Holdings Corporation
US Patent
Assay Description
[γ-33P]ATP (10 mCi/mL) was purchased from Perkin-Elmer (Waltham, Mass.). Lipid kinase substrate, D-myo-Phosphatidylinositol 4,5-bisphosphate (Pt...
US Patent US10376513 (2019)
BindingDB Entry DOI: 10.7270/Q2GQ7142
Phosphatidylinositol 4,5-bisphosphate 3-kinase catalytic subunit delta isoform
(Homo sapiens (Human))
BDBM255803
(5-{3-[1-(4-Amino-3-methyl-1H-pyrazolo[3,4-d]pyrimi...)
Show SMILES CCOc1c(cc(Cl)c(C)c1-c1ccc(nc1)C(=O)N(C)C)C(C)n1nc(C)c2c(N)ncnc12
Show InChI InChI=1S/C25H28ClN7O2/c1-7-35-22-17(15(4)33-24-21(14(3)31-33)23(27)29-12-30-24)10-18(26)13(2)20(22)16-8-9-19(28-11-16)25(34)32(5)6/h8-12,15H,7H2,1-6H3,(H2,27,29,30)
NCI pathway
Reactome pathway
US Patent
n/an/a<10n/an/an/an/an/an/a
Incyte Holdings Corporation
US Patent
Assay Description
[γ-33P]ATP (10 mCi/mL) was purchased from Perkin-Elmer (Waltham, Mass.). Lipid kinase substrate, D-myo-Phosphatidylinositol 4,5-bisphosphate (Pt...
US Patent US10376513 (2019)
BindingDB Entry DOI: 10.7270/Q2GQ7142
Phosphatidylinositol 4,5-bisphosphate 3-kinase catalytic subunit delta isoform
(Homo sapiens (Human))
BDBM255803
(5-{3-[1-(4-Amino-3-methyl-1H-pyrazolo[3,4-d]pyrimi...)
Show SMILES CCOc1c(cc(Cl)c(C)c1-c1ccc(nc1)C(=O)N(C)C)C(C)n1nc(C)c2c(N)ncnc12
Show InChI InChI=1S/C25H28ClN7O2/c1-7-35-22-17(15(4)33-24-21(14(3)31-33)23(27)29-12-30-24)10-18(26)13(2)20(22)16-8-9-19(28-11-16)25(34)32(5)6/h8-12,15H,7H2,1-6H3,(H2,27,29,30)
NCI pathway
Reactome pathway
US Patent
n/an/a<10n/an/an/an/an/an/a
Incyte Corporation; Incyte Holdings Corporation
US Patent
Assay Description
The kinase reaction was conducted in polystyrene 384-well matrix white plate from Thermo Fisher Scientific in a final volume of 25 uL. Inhibitors wer...
US Patent US10646492 (2020)
Phosphatidylinositol 4,5-bisphosphate 3-kinase catalytic subunit delta isoform
(Homo sapiens (Human))
BDBM255803
(5-{3-[1-(4-Amino-3-methyl-1H-pyrazolo[3,4-d]pyrimi...)
Show SMILES CCOc1c(cc(Cl)c(C)c1-c1ccc(nc1)C(=O)N(C)C)C(C)n1nc(C)c2c(N)ncnc12
Show InChI InChI=1S/C25H28ClN7O2/c1-7-35-22-17(15(4)33-24-21(14(3)31-33)23(27)29-12-30-24)10-18(26)13(2)20(22)16-8-9-19(28-11-16)25(34)32(5)6/h8-12,15H,7H2,1-6H3,(H2,27,29,30)
NCI pathway
Reactome pathway
US Patent
n/an/a<10n/an/an/an/an/an/a
Incyte Holdings Corporation; Incyte Corporation
US Patent
Assay Description
[γ-33P]ATP (10 mCi/mL) was purchased from PerkinElmer (Waltham, Mass.). Lipid kinase substrate, D-myo-Phosphatidylinositol 4,5-bisphosphate (Ptd...
US Patent US9730939 (2017)
BindingDB Entry DOI: 10.7270/Q2GB265W