BDBM259028 US9499502, 9dj-a
SMILES: COc1ccc(nc1)C(=O)Nc1ccc(F)c(c1)[C@]1(C)CS(=O)(=O)[C@@](C)(CC2CC2)C(=N)N1
InChI Key: InChIKey=VQKHUABFISOOBU-GOTSBHOMSA-N
Data: 2 KI
Activity Spreadsheet -- Enzyme Inhibition Constant Data from BindingDB
Found 2 hits for monomerid = 259028
Trg + Lig
Ki
nM
ΔG°
kcal/mole
IC50
nM
Kd
nM
EC50/IC50
nM
koff
s-1
kon
M-1s-1
pHTemp
°C
Beta-secretase 1
(Homo sapiens (Human))
BDBM259028
(US9499502, 9dj-a)
Show SMILES COc1ccc(nc1)C(=O)Nc1ccc(F)c(c1)[C@]1(C)CS(=O)(=O)[C@@](C)(CC2CC2)C(=N)N1 |r|
Show InChI InChI=1S/C23H27FN4O4S/c1-22(13-33(30,31)23(2,21(25)28-22)11-14-4-5-14)17-10-15(6-8-18(17)24)27-20(29)19-9-7-16(32-3)12-26-19/h6-10,12,14H,4-5,11,13H2,1-3H3,(H2,25,28)(H,27,29)/t22-,23-/m0/s1
US Patent
4.30 -11.6n/an/an/an/an/a5.030
Merck Sharp & Dohme Corp.
US Patent
Assay Description
A homogeneous time-resolved FRET assay can be used to determine IC50 values for inhibitors of the soluble human BACE1 catalytic domain. This assay mo...
US Patent US9499502 (2016)
BindingDB Entry DOI: 10.7270/Q2BV7FJJ
Beta-secretase 2
(Homo sapiens (Human))
BDBM259028
(US9499502, 9dj-a)
Show SMILES COc1ccc(nc1)C(=O)Nc1ccc(F)c(c1)[C@]1(C)CS(=O)(=O)[C@@](C)(CC2CC2)C(=N)N1 |r|
Show InChI InChI=1S/C23H27FN4O4S/c1-22(13-33(30,31)23(2,21(25)28-22)11-14-4-5-14)17-10-15(6-8-18(17)24)27-20(29)19-9-7-16(32-3)12-26-19/h6-10,12,14H,4-5,11,13H2,1-3H3,(H2,25,28)(H,27,29)/t22-,23-/m0/s1
US Patent
<10<-11.1n/an/an/an/an/a5.030
Merck Sharp & Dohme Corp.
US Patent
Assay Description
Inhibitor IC50s at purified human autoBACE-2 are determined in a time-resolved endpoint proteolysis assay that measures hydrolysis of the QSY7-EISEVN...
US Patent US9499502 (2016)
BindingDB Entry DOI: 10.7270/Q2BV7FJJ