BDBM260469 US10428074, Example 34::US9527851, 34::US9527851, example 34
SMILES: COc1nsc(NC(=O)N2C[C@@H]3C[C@H](C[C@@H]3C2)N(C)c2ncnc3[nH]ccc23)n1
InChI Key:
Data: 6 IC50
Activity Spreadsheet -- Enzyme Inhibition Constant Data from BindingDB
Found 6 hits for monomerid = 260469
Trg + Lig
Ki
nM
ΔG°
kcal/mole
IC50
nM
Kd
nM
EC50/IC50
nM
koff
s-1
kon
M-1s-1
pHTemp
°C
Tyrosine-protein kinase JAK1
(Homo sapiens (Human))
BDBM260469
(US10428074, Example 34 | US9527851, 34 | US9527851...)
Show SMILES COc1nsc(NC(=O)N2C[C@@H]3C[C@H](C[C@@H]3C2)N(C)c2ncnc3[nH]ccc23)n1 |r|
Reactome pathway
US Patent
n/an/a 2n/an/an/an/a7.327
Jiangsu Hengrui Medicine Co., Ltd.; Shanghai Hengrui Pharmaceutical Co., Ltd.
US Patent
Assay Description
In vitro kinase assays described below can be used to determine the activity of a test compound for inhibiting the activity of JAK1 kinase. The test ...
US Patent US9527851 (2016)
BindingDB Entry DOI: 10.7270/Q2HD7TM2
Tyrosine-protein kinase JAK2
(Homo sapiens (Human))
BDBM260469
(US10428074, Example 34 | US9527851, 34 | US9527851...)
Show SMILES COc1nsc(NC(=O)N2C[C@@H]3C[C@H](C[C@@H]3C2)N(C)c2ncnc3[nH]ccc23)n1 |r|
Reactome pathway
US Patent
n/an/a 5n/an/an/an/a7.327
Jiangsu Hengrui Medicine Co., Ltd.; Shanghai Hengrui Pharmaceutical Co., Ltd.
US Patent
Assay Description
In vitro kinase assays described below can be used to determine the activity of a test compound for inhibiting the activity of JAK2 kinase. The test ...
US Patent US9527851 (2016)
BindingDB Entry DOI: 10.7270/Q2HD7TM2
Tyrosine-protein kinase JAK2
(Homo sapiens (Human))
BDBM260469
(US10428074, Example 34 | US9527851, 34 | US9527851...)
Show SMILES COc1nsc(NC(=O)N2C[C@@H]3C[C@H](C[C@@H]3C2)N(C)c2ncnc3[nH]ccc23)n1 |r|
Reactome pathway
US Patent
n/an/a 5n/an/an/an/an/an/a
Jiangsu Hengrui Medicine Co., Ltd.
US Patent
Assay Description
JAK2: In vitro kinase assays described below can be used to determine the activity of a test compound for inhibiting the activity of JAK2 kinase. The...
US Patent US10428074 (2019)
BindingDB Entry DOI: 10.7270/Q26D5WC6
Tyrosine-protein kinase JAK2
(Homo sapiens (Human))
BDBM260469
(US10428074, Example 34 | US9527851, 34 | US9527851...)
Show SMILES COc1nsc(NC(=O)N2C[C@@H]3C[C@H](C[C@@H]3C2)N(C)c2ncnc3[nH]ccc23)n1 |r|
Reactome pathway
US Patent
n/an/a 5n/an/an/an/a7.325
Jiangsu Hengrui Medicine Co., Ltd.; Shanghai Hengrui Pharmaceutical Co., Ltd.
US Patent
Assay Description
In vitro kinase assays described below can be used to determine the activity of a test compound for inhibiting the activity of JAK2 kinase. The test ...
US Patent US9527851 (2016)
BindingDB Entry DOI: 10.7270/Q2D21VRM
Tyrosine-protein kinase JAK1
(Homo sapiens (Human))
BDBM260469
(US10428074, Example 34 | US9527851, 34 | US9527851...)
Show SMILES COc1nsc(NC(=O)N2C[C@@H]3C[C@H](C[C@@H]3C2)N(C)c2ncnc3[nH]ccc23)n1 |r|
Reactome pathway
US Patent
n/an/a 2n/an/an/an/an/an/a
Jiangsu Hengrui Medicine Co., Ltd.
US Patent
Assay Description
JAK1: In vitro kinase assays described below can be used to determine the activity of a test compound for inhibiting the activity of JAK1 kinase. The...
US Patent US10428074 (2019)
BindingDB Entry DOI: 10.7270/Q26D5WC6
Tyrosine-protein kinase JAK1
(Homo sapiens (Human))
BDBM260469
(US10428074, Example 34 | US9527851, 34 | US9527851...)
Show SMILES COc1nsc(NC(=O)N2C[C@@H]3C[C@H](C[C@@H]3C2)N(C)c2ncnc3[nH]ccc23)n1 |r|
Reactome pathway
US Patent
n/an/a 2n/an/an/an/a7.325
Jiangsu Hengrui Medicine Co., Ltd.; Shanghai Hengrui Pharmaceutical Co., Ltd.
US Patent
Assay Description
TBDIn vitro kinase assays described below can be used to determine the activity of a test compound for inhibiting the activity of JAK1 kinase. The te...
US Patent US9527851 (2016)
BindingDB Entry DOI: 10.7270/Q2D21VRM