BDBM26262 (2S)-2-hydroxy-2-methyl-N-[4-nitro-3-(trifluoromethyl)phenyl]-3-(2,3,4,5,6-pentafluorophenoxy)propanamide::C-23
SMILES: C[C@](O)(COc1c(F)c(F)c(F)c(F)c1F)C(=O)Nc1ccc(c(c1)C(F)(F)F)[N+]([O-])=O
InChI Key: InChIKey=MMNRWNREMUMYQG-INIZCTEOSA-N
Data: 1 KI
PDB links: 1 PDB ID matches this monomer.
Activity Spreadsheet -- Enzyme Inhibition Constant Data from BindingDB
Found 1 hit for monomerid = 26262
Trg + Lig
Ki
nM
ΔG°
kcal/mole
IC50
nM
Kd
nM
EC50/IC50
nM
koff
s-1
kon
M-1s-1
pHTemp
°C
Androgen receptor
(Rattus norvegicus (Rat))
BDBM26262
((2S)-2-hydroxy-2-methyl-N-[4-nitro-3-(trifluoromet...)
Show SMILES C[C@](O)(COc1c(F)c(F)c(F)c(F)c1F)C(=O)Nc1ccc(c(c1)C(F)(F)F)[N+]([O-])=O |r|
Show InChI InChI=1S/C17H10F8N2O5/c1-16(29,5-32-14-12(21)10(19)9(18)11(20)13(14)22)15(28)26-6-2-3-8(27(30)31)7(4-6)17(23,24)25/h2-4,29H,5H2,1H3,(H,26,28)/t16-/m0/s1
Reactome pathway
1.40 -11.2n/an/an/an/an/a7.44
The Ohio State University
Assay Description
The Ki values were determined by the application of the Cheng-Prusoff equation: Ki = (IC50 x Kd)/(Kd+[L]) where [L] is the concentration of [3H]MIB (...
Bioorg Med Chem Lett 18: 5567-70 (2008)
Article DOI: 10.1016/j.bmcl.2008.09.002
BindingDB Entry DOI: 10.7270/Q2W0948B
3D
3D Structure (crystal)