BDBM26382 4-methyl-1-N-[2-methyl-3-(trifluoromethyl)benzene]-3-N-(2-{[4-(4-methylpiperazin-1-yl)phenyl]amino}pyrimidin-5-yl)benzene-1,3-dicarboxamide::Aminopyrimidine amide, 19
SMILES: CN1CCN(CC1)c1ccc(Nc2ncc(NC(=O)c3cc(NC(=O)c4cccc(c4C)C(F)(F)F)ccc3C)cn2)cc1
InChI Key: InChIKey=YNJXLRWECIJSPA-UHFFFAOYSA-N
Data: 5 IC50
PDB links: 1 PDB ID matches this monomer.
Activity Spreadsheet -- Enzyme Inhibition Constant Data from BindingDB
Found 5 hits for monomerid = 26382
Trg + Lig
Ki
nM
ΔG°
kcal/mole
IC50
nM
Kd
nM
EC50/IC50
nM
koff
s-1
kon
M-1s-1
pHTemp
°C
Tyrosine-protein kinase Lck
(Homo sapiens (Human))
BDBM26382
(4-methyl-1-N-[2-methyl-3-(trifluoromethyl)benzene]...)
Show SMILES CN1CCN(CC1)c1ccc(Nc2ncc(NC(=O)c3cc(NC(=O)c4cccc(c4C)C(F)(F)F)ccc3C)cn2)cc1
Show InChI InChI=1S/C32H32F3N7O2/c1-20-7-8-23(38-29(43)26-5-4-6-28(21(26)2)32(33,34)35)17-27(20)30(44)39-24-18-36-31(37-19-24)40-22-9-11-25(12-10-22)42-15-13-41(3)14-16-42/h4-12,17-19H,13-16H2,1-3H3,(H,38,43)(H,39,44)(H,36,37,40)
n/an/a 0.800n/an/an/an/a7.522
Amgen
Assay Description
The assay involves the phosphorylation of a biotinylated substrate and the detection of this phosphorylation after the addition of a streptavidin-all...
J Med Chem 51: 1681-94 (2008)
Article DOI: 10.1021/jm7010996
BindingDB Entry DOI: 10.7270/Q2Q81BCB
3D
3D Structure (crystal)
Angiopoietin-1 receptor
(Homo sapiens (Human))
BDBM26382
(4-methyl-1-N-[2-methyl-3-(trifluoromethyl)benzene]...)
Show SMILES CN1CCN(CC1)c1ccc(Nc2ncc(NC(=O)c3cc(NC(=O)c4cccc(c4C)C(F)(F)F)ccc3C)cn2)cc1
Show InChI InChI=1S/C32H32F3N7O2/c1-20-7-8-23(38-29(43)26-5-4-6-28(21(26)2)32(33,34)35)17-27(20)30(44)39-24-18-36-31(37-19-24)40-22-9-11-25(12-10-22)42-15-13-41(3)14-16-42/h4-12,17-19H,13-16H2,1-3H3,(H,38,43)(H,39,44)(H,36,37,40)
n/an/a>8.30E+3n/an/an/an/an/an/a
Amgen
Assay Description
The assay involves the phosphorylation of a biotinylated substrate and the detection of this phosphorylation after the addition of a streptavidin-all...
J Med Chem 51: 1681-94 (2008)
Article DOI: 10.1021/jm7010996
BindingDB Entry DOI: 10.7270/Q2Q81BCB
Tyrosine-protein kinase JAK3
(Homo sapiens (Human))
BDBM26382
(4-methyl-1-N-[2-methyl-3-(trifluoromethyl)benzene]...)
Show SMILES CN1CCN(CC1)c1ccc(Nc2ncc(NC(=O)c3cc(NC(=O)c4cccc(c4C)C(F)(F)F)ccc3C)cn2)cc1
Show InChI InChI=1S/C32H32F3N7O2/c1-20-7-8-23(38-29(43)26-5-4-6-28(21(26)2)32(33,34)35)17-27(20)30(44)39-24-18-36-31(37-19-24)40-22-9-11-25(12-10-22)42-15-13-41(3)14-16-42/h4-12,17-19H,13-16H2,1-3H3,(H,38,43)(H,39,44)(H,36,37,40)
Reactome pathway
n/an/a>2.50E+4n/an/an/an/an/an/a
Amgen
Assay Description
The assay involves the phosphorylation of a biotinylated substrate and the detection of this phosphorylation after the addition of a streptavidin-all...
J Med Chem 51: 1681-94 (2008)
Article DOI: 10.1021/jm7010996
BindingDB Entry DOI: 10.7270/Q2Q81BCB
Mitogen-activated protein kinase 14
(Homo sapiens (Human))
BDBM26382
(4-methyl-1-N-[2-methyl-3-(trifluoromethyl)benzene]...)
Show SMILES CN1CCN(CC1)c1ccc(Nc2ncc(NC(=O)c3cc(NC(=O)c4cccc(c4C)C(F)(F)F)ccc3C)cn2)cc1
Show InChI InChI=1S/C32H32F3N7O2/c1-20-7-8-23(38-29(43)26-5-4-6-28(21(26)2)32(33,34)35)17-27(20)30(44)39-24-18-36-31(37-19-24)40-22-9-11-25(12-10-22)42-15-13-41(3)14-16-42/h4-12,17-19H,13-16H2,1-3H3,(H,38,43)(H,39,44)(H,36,37,40)
NCI pathway
Reactome pathway
n/an/a 12n/an/an/an/an/an/a
Amgen
Assay Description
In vitro kinase assays were done to establish IC50 values against recombinant enzymes using homogeneous time-resolved fluorescence (HTRF) assay. For ...
J Med Chem 51: 1681-94 (2008)
Article DOI: 10.1021/jm7010996
BindingDB Entry DOI: 10.7270/Q2Q81BCB
Vascular endothelial growth factor receptor 2
(Homo sapiens (Human))
BDBM26382
(4-methyl-1-N-[2-methyl-3-(trifluoromethyl)benzene]...)
Show SMILES CN1CCN(CC1)c1ccc(Nc2ncc(NC(=O)c3cc(NC(=O)c4cccc(c4C)C(F)(F)F)ccc3C)cn2)cc1
Show InChI InChI=1S/C32H32F3N7O2/c1-20-7-8-23(38-29(43)26-5-4-6-28(21(26)2)32(33,34)35)17-27(20)30(44)39-24-18-36-31(37-19-24)40-22-9-11-25(12-10-22)42-15-13-41(3)14-16-42/h4-12,17-19H,13-16H2,1-3H3,(H,38,43)(H,39,44)(H,36,37,40)
NCI pathway
Reactome pathway
n/an/a 54n/an/an/an/an/an/a
Amgen
Assay Description
The assay involves the phosphorylation of a biotinylated substrate and the detection of this phosphorylation after the addition of a streptavidin-all...
J Med Chem 51: 1681-94 (2008)
Article DOI: 10.1021/jm7010996
BindingDB Entry DOI: 10.7270/Q2Q81BCB