BDBM266086 US9718790, I-2119
SMILES: CCn1c(=O)[nH]\c(=N/c2ccc(Oc3ccc(nc3)C(N)=O)cc2)n(Cc2ccc(Cl)cc2)c1=O
InChI Key: InChIKey=PNCHTQOOKMPVBP-UHFFFAOYSA-N
Data: 1 IC50
Activity Spreadsheet -- Enzyme Inhibition Constant Data from BindingDB
Found 1 hit for monomerid = 266086
Trg + Lig
Ki
nM
ΔG°
kcal/mole
IC50
nM
Kd
nM
EC50/IC50
nM
koff
s-1
kon
M-1s-1
pHTemp
°C
P2X purinoceptor 3
(Homo sapiens (Human))
BDBM266086
(US9718790, I-2119)
Show SMILES CCn1c(=O)[nH]\c(=N/c2ccc(Oc3ccc(nc3)C(N)=O)cc2)n(Cc2ccc(Cl)cc2)c1=O
Show InChI InChI=1S/C24H21ClN6O4/c1-2-30-23(33)29-22(31(24(30)34)14-15-3-5-16(25)6-4-15)28-17-7-9-18(10-8-17)35-19-11-12-20(21(26)32)27-13-19/h3-13H,2,14H2,1H3,(H2,26,32)(H,28,29,33)
US Patent
n/an/a 1n/an/an/an/a7.5n/a
SHIONOGI & CO., LTD.
US Patent
Assay Description
Stably expressing cell line (C6BU-1 transfected with human P2X3 receptor gene (GenBank accession number Y07683) was used. The cells were seeded in a ...
US Patent US9718790 (2017)
BindingDB Entry DOI: 10.7270/Q22809KB