BDBM26669 4-[3-(4-chlorophenyl)-2,1-benzoxazol-5-yl]pyrimidin-2-amine::benzisoxazole-pyrimidine, 2
SMILES: Nc1nccc(n1)-c1ccc2noc(-c3ccc(Cl)cc3)c2c1
InChI Key: InChIKey=AQVFETGXIRKVAQ-UHFFFAOYSA-N
Data: 1 KI
PDB links: 1 PDB ID matches this monomer.
Activity Spreadsheet -- Enzyme Inhibition Constant Data from BindingDB
Found 1 hit for monomerid = 26669
Trg + Lig
Ki
nM
ΔG°
kcal/mole
IC50
nM
Kd
nM
EC50/IC50
nM
koff
s-1
kon
M-1s-1
pHTemp
°C
Serine/threonine-protein kinase pim-1
(Homo sapiens (Human))
BDBM26669
(4-[3-(4-chlorophenyl)-2,1-benzoxazol-5-yl]pyrimidi...)
Show SMILES Nc1nccc(n1)-c1ccc2noc(-c3ccc(Cl)cc3)c2c1
Show InChI InChI=1S/C17H11ClN4O/c18-12-4-1-10(2-5-12)16-13-9-11(3-6-15(13)22-23-16)14-7-8-20-17(19)21-14/h1-9H,(H2,19,20,21)
91 -9.76n/an/an/an/an/a7.630
Vertex
Assay Description
A coupled-enzyme assay was used to quantify the ADP generated in the kinase reaction with S6 peptide (RRRLSSLRA) as the phosphoacceptor substrate.
J Med Chem 51: 1972-5 (2008)
Article DOI: 10.1021/jm701248t
BindingDB Entry DOI: 10.7270/Q2HM56RQ
3D
3D Structure (crystal)