null
SMILES: Cn1c(nc2sc(nc2c1=O)N1CCC[C@@H]1C(=O)NCc1ccccc1)N1CCOCC1
InChI Key: InChIKey=WXXIRNKABVFFTA-MRXNPFEDSA-N
Activity Spreadsheet -- Enzyme Inhibition Constant Data from BindingDB
Found 1 hit for monomerid = 273116
Trg + Lig
Ki
nM
ΔG°
kcal/mole
IC50
nM
Kd
nM
EC50/IC50
nM
koff
s-1
kon
M-1s-1
pHTemp
°C
Kynurenine/alpha-aminoadipate aminotransferase, mitochondrial
(Homo sapiens (Human))
BDBM273116
((R)-N-benzyl-1-[6-methyl-5-(morpholin-4-yl)-7-oxo-...)
Show SMILES Cn1c(nc2sc(nc2c1=O)N1CCC[C@@H]1C(=O)NCc1ccccc1)N1CCOCC1 |r|
Show InChI InChI=1S/C22H26N6O3S/c1-26-20(30)17-19(25-21(26)27-10-12-31-13-11-27)32-22(24-17)28-9-5-8-16(28)18(29)23-14-15-6-3-2-4-7-15/h2-4,6-7,16H,5,8-14H2,1H3,(H,23,29)/t16-/m1/s1
Reactome pathway
US Patent
n/an/a 7.90n/an/an/an/a8.0n/a
MITSUBISHI TANABE PHARMA CORPORATION
US Patent
Assay Description
The inhibitory action of the test compound on human recombinant KAT-II was determined by the following method.To a reaction mixture (45 μL) cont...
US Patent US10065972 (2018)
BindingDB Entry DOI: 10.7270/Q23X88P5