BDBM276046 2-[1-(1,2,3,4-tetrahydronaphthalen-1-ylmethyl)imidazol-4-yl]-4-(1H-triazol-4-yl)pyridine::US10071984, Example 8::US10174003, Example 8::US9896436, Example 8
SMILES: C(C1CCCc2ccccc12)n1cnc(c1)-c1cc(ccn1)-c1c[nH]nn1
InChI Key:
Data: 9 IC50
Activity Spreadsheet -- Enzyme Inhibition Constant Data from BindingDB
Found 9 hits for monomerid = 276046
Trg + Lig
Ki
nM
ΔG°
kcal/mole
IC50
nM
Kd
nM
EC50/IC50
nM
koff
s-1
kon
M-1s-1
pHTemp
°C
Lysine-specific demethylase 2B
(Homo sapiens (Human))
BDBM276046
(2-[1-(1,2,3,4-tetrahydronaphthalen-1-ylmethyl)imid...)
Show SMILES C(C1CCCc2ccccc12)n1cnc(c1)-c1cc(ccn1)-c1c[nH]nn1
US Patent
n/an/a<100n/an/an/an/an/a25
Celgene Quanticel Research, Inc.
US Patent
Assay Description
The ability of test compounds to inhibit the activity of FBXL10 was determined in 384-well plate format under the following reaction conditions: 0.3 ...
US Patent US10071984 (2018)
BindingDB Entry DOI: 10.7270/Q24Q7X0X
Homo sapiens lysine demethylase 2A (KDM2A)
(Homo sapiens (Human))
BDBM276046
(2-[1-(1,2,3,4-tetrahydronaphthalen-1-ylmethyl)imid...)
Show SMILES C(C1CCCc2ccccc12)n1cnc(c1)-c1cc(ccn1)-c1c[nH]nn1
US Patent
n/an/a<100n/an/an/an/an/a25
Celgene Quanticel Research, Inc.
US Patent
Assay Description
The ability of test compounds to inhibit the activity of FBXL11 was determined in 384-well plate format under the following reaction conditions: 0.15...
US Patent US10071984 (2018)
BindingDB Entry DOI: 10.7270/Q24Q7X0X
histone lysine demethylase PHF8 isoform 2
(Homo sapiens (Human))
BDBM276046
(2-[1-(1,2,3,4-tetrahydronaphthalen-1-ylmethyl)imid...)
Show SMILES C(C1CCCc2ccccc12)n1cnc(c1)-c1cc(ccn1)-c1c[nH]nn1
US Patent
n/an/a 550n/an/an/an/an/a25
Celgene Quanticel Research, Inc.
US Patent
Assay Description
The ability of test compounds to inhibit the activity of PHF8 was determined in 384-well plate format under the following reaction conditions: 3 nM P...
US Patent US10071984 (2018)
BindingDB Entry DOI: 10.7270/Q24Q7X0X
Lysine-specific demethylase 2B
(Homo sapiens (Human))
BDBM276046
(2-[1-(1,2,3,4-tetrahydronaphthalen-1-ylmethyl)imid...)
Show SMILES C(C1CCCc2ccccc12)n1cnc(c1)-c1cc(ccn1)-c1c[nH]nn1
US Patent
n/an/a<100n/an/an/an/an/an/a
Celgene Quanticel Research, Inc.
US Patent
Assay Description
The ability of test compounds to inhibit the activity of FBXL10 was determined in 384-well plate format under the following reaction conditions: 0.3 ...
US Patent US10174003 (2019)
BindingDB Entry DOI: 10.7270/Q2417053
Histone lysine demethylase PHF8
(Homo sapiens (Human))
BDBM276046
(2-[1-(1,2,3,4-tetrahydronaphthalen-1-ylmethyl)imid...)
Show SMILES C(C1CCCc2ccccc12)n1cnc(c1)-c1cc(ccn1)-c1c[nH]nn1
US Patent
n/an/a 300n/an/an/an/an/an/a
GSK
Assay Description
PHF8 Assay: The ability of test compounds to inhibit the activity of PHF8 was determined in 384-well plate format under the following reaction condit...
Bioorg Med Chem Lett 17: 1584-9 (2007)
BindingDB Entry DOI: 10.7270/Q2FT8PBQ
Histone lysine demethylase PHF8
(Homo sapiens (Human))
BDBM276046
(2-[1-(1,2,3,4-tetrahydronaphthalen-1-ylmethyl)imid...)
Show SMILES C(C1CCCc2ccccc12)n1cnc(c1)-c1cc(ccn1)-c1c[nH]nn1
US Patent
n/an/a 550n/an/an/an/an/an/a
Celgene Quanticel Research, Inc.
US Patent
Assay Description
The ability of test compounds to inhibit the activity of PHF8 was determined in 384-well plate format under the following reaction conditions: 3 nM P...
US Patent US10174003 (2019)
BindingDB Entry DOI: 10.7270/Q2417053
Lysine-specific demethylase 2B
(Homo sapiens (Human))
BDBM276046
(2-[1-(1,2,3,4-tetrahydronaphthalen-1-ylmethyl)imid...)
Show SMILES C(C1CCCc2ccccc12)n1cnc(c1)-c1cc(ccn1)-c1c[nH]nn1
US Patent
n/an/a<100n/an/an/an/an/an/a
GSK
Assay Description
The ability of test compounds to inhibit the activity of FBXL10 was determined in 384-well plate format under the following reaction conditions: 0.3 ...
Bioorg Med Chem Lett 17: 1584-9 (2007)
BindingDB Entry DOI: 10.7270/Q2FT8PBQ
Homo sapiens lysine demethylase 2A (KDM2A)
(Homo sapiens (Human))
BDBM276046
(2-[1-(1,2,3,4-tetrahydronaphthalen-1-ylmethyl)imid...)
Show SMILES C(C1CCCc2ccccc12)n1cnc(c1)-c1cc(ccn1)-c1c[nH]nn1
US Patent
n/an/a<100n/an/an/an/an/an/a
GSK
Assay Description
PHF8 Assay: The ability of test compounds to inhibit the activity of PHF8 was determined in 384-well plate format under the following reaction condit...
Bioorg Med Chem Lett 17: 1584-9 (2007)
BindingDB Entry DOI: 10.7270/Q2FT8PBQ
Homo sapiens lysine demethylase 2A (KDM2A)
(Homo sapiens (Human))
BDBM276046
(2-[1-(1,2,3,4-tetrahydronaphthalen-1-ylmethyl)imid...)
Show SMILES C(C1CCCc2ccccc12)n1cnc(c1)-c1cc(ccn1)-c1c[nH]nn1
US Patent
n/an/a<100n/an/an/an/an/an/a
Celgene Quanticel Research, Inc.
US Patent
Assay Description
The ability of test compounds to inhibit the activity of FBXL11 was determined in 384-well plate format under the following reaction conditions: 0.15...
US Patent US10174003 (2019)
BindingDB Entry DOI: 10.7270/Q2417053