BDBM280968 5-[4-(2H-tetrazol- 5-yl)pyridin-2- yl]-4-amino-2- [6-chloro-1-(2- fluorobenzyl)-1H- indazol-3-yl]-5- methyl-5,7- dihydro-6H- pyrrolo[2,3-d] pyrimidin-6-one::US10030027, Example 243A::US10428076, Example 243A
SMILES: CC1(C(=O)Nc2nc(nc(N)c12)-c1nn(Cc2ccccc2F)c2cc(Cl)ccc12)c1cc(ccn1)-c1nn[nH]n1
InChI Key:
Data: 2 KI
Activity Spreadsheet -- Enzyme Inhibition Constant Data from BindingDB
Found 2 hits for monomerid = 280968
Trg + Lig
Ki
nM
ΔG°
kcal/mole
IC50
nM
Kd
nM
EC50/IC50
nM
koff
s-1
kon
M-1s-1
pHTemp
°C
Soluble Guanylate Cyclases
(Homo sapiens (Human))
BDBM280968
(5-[4-(2H-tetrazol- 5-yl)pyridin-2- yl]-4-amino-2- ...)
Show SMILES CC1(C(=O)Nc2nc(nc(N)c12)-c1nn(Cc2ccccc2F)c2cc(Cl)ccc12)c1cc(ccn1)-c1nn[nH]n1
US Patent
0.0620n/an/an/an/an/an/an/an/a
Merck Sharp & Dohme Corp.
US Patent
Assay Description
The binding buffer was composed of 50 mM triethanolamine, pH 7.4, 3 mM MgCl2, 0.025% BSA, 2 mM dithiothreitol (DTT), 300 μM DETA/NO and 400 _...
US Patent US10428076 (2019)
BindingDB Entry DOI: 10.7270/Q22N54P9
Guanylate cyclase soluble subunit alpha-1
(Homo sapiens (Human))
BDBM280968
(5-[4-(2H-tetrazol- 5-yl)pyridin-2- yl]-4-amino-2- ...)
Show SMILES CC1(C(=O)Nc2nc(nc(N)c12)-c1nn(Cc2ccccc2F)c2cc(Cl)ccc12)c1cc(ccn1)-c1nn[nH]n1
US Patent
0.0620n/an/an/an/an/an/a7.4n/a
Merck Sharp & Dohme Corp.
US Patent
Assay Description
The binding potencies of sGC compounds to the human recombinant sGC enzyme were determined in a Size Exclusion Chromatography (SEC) competition bindi...
US Patent US10030027 (2018)
BindingDB Entry DOI: 10.7270/Q22N549C