null
SMILES: Nc1n[nH]c2ncc(cc12)-c1ccc(CNc2ncc(cc2C(=O)NCC2CCCO2)C(F)(F)F)cc1
InChI Key:
Activity Spreadsheet -- Enzyme Inhibition Constant Data from BindingDB
Found 1 hit for monomerid = 282385
Trg + Lig
Ki
nM
ΔG°
kcal/mole
IC50
nM
Kd
nM
EC50/IC50
nM
koff
s-1
kon
M-1s-1
pHTemp
°C
3-phosphoinositide-dependent protein kinase 1 [51-359]
(Homo sapiens (Human))
BDBM282385
(2-(4-(3-amino-1H-pyrazolo [3,4-b]pyridin-5-yl) ben...)
Show SMILES Nc1n[nH]c2ncc(cc12)-c1ccc(CNc2ncc(cc2C(=O)NCC2CCCO2)C(F)(F)F)cc1
US Patent
n/an/a<100n/an/an/an/an/an/a
Sunesis Pharmaceuticals, Inc.; Millenium Pharmaceuticals, Inc.
US Patent
Assay Description
PDK1 (amino acids 51-359) and AKT2 (amino acids 140-467 fused to PIFtide, amino acids EEQEMFRDFDYIADW) were expressed as N-terminally tagged GST fusi...
US Patent US10030016 (2018)
BindingDB Entry DOI: 10.7270/Q2S46V16