BDBM28421 (2R,3R,4S,5R)-2-(6-amino-8-methyl-9H-purin-9-yl)-5-({[2-(aminooxy)ethyl](methyl)amino}methyl)oxolane-3,4-diol::AdoMet substrate analogue, 12a
SMILES: CN(CCON)C[C@H]1O[C@H]([C@H](O)[C@@H]1O)n1c(C)nc2c(N)ncnc12
InChI Key: InChIKey=MIGFZONTOHGZMB-IDTAVKCVSA-N
Data: 1 IC50
PDB links: 1 PDB ID matches this monomer.
Activity Spreadsheet -- Enzyme Inhibition Constant Data from BindingDB
Found 1 hit for monomerid = 28421
Trg + Lig
Ki
nM
ΔG°
kcal/mole
IC50
nM
Kd
nM
EC50/IC50
nM
koff
s-1
kon
M-1s-1
pHTemp
°C
S-adenosylmethionine decarboxylase 1
(Homo sapiens (Human))
BDBM28421
((2R,3R,4S,5R)-2-(6-amino-8-methyl-9H-purin-9-yl)-5...)
Show SMILES CN(CCON)C[C@H]1O[C@H]([C@H](O)[C@@H]1O)n1c(C)nc2c(N)ncnc12
Show InChI InChI=1S/C14H23N7O4/c1-7-19-9-12(15)17-6-18-13(9)21(7)14-11(23)10(22)8(25-14)5-20(2)3-4-24-16/h6,8,10-11,14,22-23H,3-5,16H2,1-2H3,(H2,15,17,18)/t8-,10-,11-,14-/m1/s1
Reactome pathway
n/an/a 7n/an/an/an/a6.822
Cornell University
Assay Description
The C-terminal his-tagged AdoMetDC was assayed by measuring the release of 14CO2 from S-adenosyl-L-[carboxy-14C]methionine (Amersham Pharmacia Biotec...
J Med Chem 52: 1388-407 (2009)
Article DOI: 10.1021/jm801126a
BindingDB Entry DOI: 10.7270/Q2222S3J
3D
3D Structure (crystal)