BDBM28455 AdoMet substrate analogue, 25d::{[(2S,3S,4R,5R)-5-(6-amino-9H-purin-9-yl)-3,4-dihydroxyoxolan-2-yl]methyl}dimethylsulfanium chloride
SMILES: C[S+](C)C[C@H]1O[C@H]([C@H](O)[C@@H]1O)n1cnc2c(N)ncnc12
InChI Key: InChIKey=DVNIRPKXKMIDQU-WOUKDFQISA-N
Data: 1 IC50
PDB links: 127 PDB IDs contain this monomer as substructures. 127 PDB IDs contain inhibitors having a similarity of 90% to this monomer.
Activity Spreadsheet -- Enzyme Inhibition Constant Data from BindingDB
Found 1 hit for monomerid = 28455
Trg + Lig
Ki
nM
ΔG°
kcal/mole
IC50
nM
Kd
nM
EC50/IC50
nM
koff
s-1
kon
M-1s-1
pHTemp
°C
S-adenosylmethionine decarboxylase 1
(Homo sapiens (Human))
BDBM28455
(AdoMet substrate analogue, 25d | {[(2S,3S,4R,5R)-5...)
Show SMILES C[S+](C)C[C@H]1O[C@H]([C@H](O)[C@@H]1O)n1cnc2c(N)ncnc12
Show InChI InChI=1S/C12H18N5O3S/c1-21(2)3-6-8(18)9(19)12(20-6)17-5-16-7-10(13)14-4-15-11(7)17/h4-6,8-9,12,18-19H,3H2,1-2H3,(H2,13,14,15)/q+1/t6-,8-,9-,12-/m1/s1
Reactome pathway
n/an/a 1.50E+4n/an/an/an/an/an/a
Cornell University
Assay Description
The C-terminal his-tagged AdoMetDC was assayed by measuring the release of 14CO2 from S-adenosyl-L-[carboxy-14C]methionine (Amersham Pharmacia Biotec...
J Med Chem 52: 1388-407 (2009)
Article DOI: 10.1021/jm801126a
BindingDB Entry DOI: 10.7270/Q2222S3J