BDBM285781 US10080744, Example 6
SMILES: CC[C@H](NS(=O)(=O)c1ccc(-c2sc(nc2CN2CCCC(F)(F)C2)-c2nnc(o2)C(C)(C)O)c(Cl)c1Cl)C(F)(F)F
InChI Key: InChIKey=JALBDPKDJRGDDX-HNNXBMFYSA-N
Data: 1 IC50  1 Kd
Activity Spreadsheet -- Enzyme Inhibition Constant Data from BindingDB
Found 2 hits for monomerid = 285781
Trg + Lig
Ki
nM
ΔG°
kcal/mole
IC50
nM
Kd
nM
EC50/IC50
nM
koff
s-1
kon
M-1s-1
pHTemp
°C
Nuclear receptor ROR-gamma (RORC)
(Homo sapiens (Human))
BDBM285781
(US10080744, Example 6)
Show SMILES CC[C@H](NS(=O)(=O)c1ccc(-c2sc(nc2CN2CCCC(F)(F)C2)-c2nnc(o2)C(C)(C)O)c(Cl)c1Cl)C(F)(F)F |r|
Show InChI InChI=1S/C24H26Cl2F5N5O4S2/c1-4-15(24(29,30)31)35-42(38,39)14-7-6-12(16(25)17(14)26)18-13(10-36-9-5-8-23(27,28)11-36)32-20(41-18)19-33-34-21(40-19)22(2,3)37/h6-7,15,35,37H,4-5,8-11H2,1-3H3/t15-/m0/s1
US Patent
n/an/a 6n/an/an/an/an/an/a
Janssen Pharmaceutica NV
US Patent
Assay Description
Cells used in this assay were transiently co-transfected with three different plasmids, one expressing the GAL4-DNA binding domain (DBD)-RORγt f...
US Patent US10080744 (2018)
BindingDB Entry DOI: 10.7270/Q21J9CVM
Nuclear receptor ROR-gamma (RORC)
(Homo sapiens (Human))
BDBM285781
(US10080744, Example 6)
Show SMILES CC[C@H](NS(=O)(=O)c1ccc(-c2sc(nc2CN2CCCC(F)(F)C2)-c2nnc(o2)C(C)(C)O)c(Cl)c1Cl)C(F)(F)F |r|
Show InChI InChI=1S/C24H26Cl2F5N5O4S2/c1-4-15(24(29,30)31)35-42(38,39)14-7-6-12(16(25)17(14)26)18-13(10-36-9-5-8-23(27,28)11-36)32-20(41-18)19-33-34-21(40-19)22(2,3)37/h6-7,15,35,37H,4-5,8-11H2,1-3H3/t15-/m0/s1
US Patent
n/an/an/a 1.20n/an/an/an/an/a
Janssen Pharmaceutica NV
US Patent
Assay Description
For the RORγt construct used in the ThermoFluor assay, numbering for the nucleotide sequences was based on the reference sequence for human ROR&...
US Patent US10080744 (2018)
BindingDB Entry DOI: 10.7270/Q21J9CVM