BDBM285883 (S)-methyl [4-(2-{3-[5- chloro-2-(1H-tetrazol-1- yl)phenyl]-7-hydroxy-1- oxido-6,7-dihydro-5H- cyclopenta[b]pyridin-7-yl}- 1H-imidazol-5-yl)-3- fluorophenyl]carbamate::US10081617, Example 118::US10081617, Example 31
SMILES: COC(=O)Nc1ccc(-c2cnc([nH]2)[C@]2(O)CCc3cc(c[n+]([O-])c23)-c2cc(Cl)ccc2-n2cnnn2)c(F)c1
InChI Key:
Data: 2 IC50
Activity Spreadsheet -- Enzyme Inhibition Constant Data from BindingDB
Found 2 hits for monomerid = 285883
Trg + Lig
Ki
nM
ΔG°
kcal/mole
IC50
nM
Kd
nM
EC50/IC50
nM
koff
s-1
kon
M-1s-1
pHTemp
°C
Coagulation factor XI
(Homo sapiens (Human))
BDBM285883
((S)-methyl [4-(2-{3-[5- chloro-2-(1H-tetrazol-1- y...)
Show SMILES COC(=O)Nc1ccc(-c2cnc([nH]2)[C@]2(O)CCc3cc(c[n+]([O-])c23)-c2cc(Cl)ccc2-n2cnnn2)c(F)c1 |r|
Reactome pathway
US Patent
n/an/a 0.280n/an/an/an/a7.4n/a
Merck Sharp & Dohme Corp.
US Patent
Assay Description
Factor XIa determinations were made in 50 mM HEPES buffer at pH 7.4 containing 150 mM NaCl, 5 mM CaCl2, and 0.1% PEG 8000 (polyethylene glycol; JT Ba...
US Patent US10081617 (2018)
BindingDB Entry DOI: 10.7270/Q2CR5WDN
Coagulation factor XI
(Homo sapiens (Human))
BDBM285883
((S)-methyl [4-(2-{3-[5- chloro-2-(1H-tetrazol-1- y...)
Show SMILES COC(=O)Nc1ccc(-c2cnc([nH]2)[C@]2(O)CCc3cc(c[n+]([O-])c23)-c2cc(Cl)ccc2-n2cnnn2)c(F)c1 |r|
Reactome pathway
US Patent
n/an/a 1.47n/an/an/an/a7.4n/a
Merck Sharp & Dohme Corp.
US Patent
Assay Description
Factor XIa determinations were made in 50 mM HEPES buffer at pH 7.4 containing 150 mM NaCl, 5 mM CaCl2, and 0.1% PEG 8000 (polyethylene glycol; JT Ba...
US Patent US10081617 (2018)
BindingDB Entry DOI: 10.7270/Q2CR5WDN