BDBM286097 (S)-3-(7-(methyl(7H-pyrrolo[2,3-d]pyrimidin-4-yl)amino)-5-azaspiro[2.4]heptan-5-yl)-3-oxopropanenitrile::US10081635, Example 66
SMILES: CN([C@@H]1CN(CC11CC1)C(=O)CC#N)c1ncnc2[nH]ccc12
InChI Key: InChIKey=VCBQNQKWRAHHIR-GFCCVEGCSA-N
Data: 4 IC50
Activity Spreadsheet -- Enzyme Inhibition Constant Data from BindingDB
Found 4 hits for monomerid = 286097
Trg + Lig
Ki
nM
ΔG°
kcal/mole
IC50
nM
Kd
nM
EC50/IC50
nM
koff
s-1
kon
M-1s-1
pHTemp
°C
Tyrosine-protein kinase JAK1
(Homo sapiens (Human))
BDBM286097
((S)-3-(7-(methyl(7H-pyrrolo[2,3-d]pyrimidin-4-yl)a...)
Show SMILES CN([C@@H]1CN(CC11CC1)C(=O)CC#N)c1ncnc2[nH]ccc12 |r|
Show InChI InChI=1S/C16H18N6O/c1-21(15-11-3-7-18-14(11)19-10-20-15)12-8-22(13(23)2-6-17)9-16(12)4-5-16/h3,7,10,12H,2,4-5,8-9H2,1H3,(H,18,19,20)/t12-/m1/s1
Reactome pathway
US Patent
n/an/a 787n/an/an/an/an/an/a
YANG JI CHEMICAL CO., LTD.; HAN WHA PHARMA CO., LTD.
US Patent
Assay Description
Kinases used were human-derived JAK1, JAK2, JAK3, and TYK2 (Millipore, Germany). Each of these kinases was diluted with a suitable buffer solution as...
US Patent US10081635 (2018)
BindingDB Entry DOI: 10.7270/Q2R213D4
Non-receptor tyrosine-protein kinase TYK2
(Homo sapiens (Human))
BDBM286097
((S)-3-(7-(methyl(7H-pyrrolo[2,3-d]pyrimidin-4-yl)a...)
Show SMILES CN([C@@H]1CN(CC11CC1)C(=O)CC#N)c1ncnc2[nH]ccc12 |r|
Show InChI InChI=1S/C16H18N6O/c1-21(15-11-3-7-18-14(11)19-10-20-15)12-8-22(13(23)2-6-17)9-16(12)4-5-16/h3,7,10,12H,2,4-5,8-9H2,1H3,(H,18,19,20)/t12-/m1/s1
US Patent
n/an/a>1.00E+3n/an/an/an/an/an/a
YANG JI CHEMICAL CO., LTD.; HAN WHA PHARMA CO., LTD.
US Patent
Assay Description
Kinases used were human-derived JAK1, JAK2, JAK3, and TYK2 (Millipore, Germany). Each of these kinases was diluted with a suitable buffer solution as...
US Patent US10081635 (2018)
BindingDB Entry DOI: 10.7270/Q2R213D4
Tyrosine-protein kinase JAK3
(Homo sapiens (Human))
BDBM286097
((S)-3-(7-(methyl(7H-pyrrolo[2,3-d]pyrimidin-4-yl)a...)
Show SMILES CN([C@@H]1CN(CC11CC1)C(=O)CC#N)c1ncnc2[nH]ccc12 |r|
Show InChI InChI=1S/C16H18N6O/c1-21(15-11-3-7-18-14(11)19-10-20-15)12-8-22(13(23)2-6-17)9-16(12)4-5-16/h3,7,10,12H,2,4-5,8-9H2,1H3,(H,18,19,20)/t12-/m1/s1
Reactome pathway
US Patent
n/an/a>1.00E+3n/an/an/an/an/an/a
YANG JI CHEMICAL CO., LTD.; HAN WHA PHARMA CO., LTD.
US Patent
Assay Description
Kinases used were human-derived JAK1, JAK2, JAK3, and TYK2 (Millipore, Germany). Each of these kinases was diluted with a suitable buffer solution as...
US Patent US10081635 (2018)
BindingDB Entry DOI: 10.7270/Q2R213D4
Tyrosine-protein kinase JAK1
(Homo sapiens (Human))
BDBM286097
((S)-3-(7-(methyl(7H-pyrrolo[2,3-d]pyrimidin-4-yl)a...)
Show SMILES CN([C@@H]1CN(CC11CC1)C(=O)CC#N)c1ncnc2[nH]ccc12 |r|
Show InChI InChI=1S/C16H18N6O/c1-21(15-11-3-7-18-14(11)19-10-20-15)12-8-22(13(23)2-6-17)9-16(12)4-5-16/h3,7,10,12H,2,4-5,8-9H2,1H3,(H,18,19,20)/t12-/m1/s1
Reactome pathway
US Patent
n/an/a>1.00E+3n/an/an/an/an/an/a
YANG JI CHEMICAL CO., LTD.; HAN WHA PHARMA CO., LTD.
US Patent
Assay Description
Kinases used were human-derived JAK1, JAK2, JAK3, and TYK2 (Millipore, Germany). Each of these kinases was diluted with a suitable buffer solution as...
US Patent US10081635 (2018)
BindingDB Entry DOI: 10.7270/Q2R213D4